program: Gaussian 09
title: 000261310
version: EM64L-G09RevD.01
frameworkgroup: C1[X(C17H22N2O5)]
method: RPBEPBE
basis: SDD
operation: Freq
keyword: #p
keyword: freq=noraman
keyword: PBEPBE/SDD
title: #p freq=noraman PBEPBE/SDD
converged: YES YES NO NO
title: Mulliken charges:
elementType: O O O O O N N C C C C C C C C C C C C C C C C C H H H H H H H H H H H H H H H H H H H H H H
charge: -0.438798 -0.466831 -0.262630 -0.255870 -0.330131 -0.161891 -0.042132 -0.452627 -0.392365 0.327487 0.304476 -0.330799 -0.314901 -0.036360 -0.360432 -0.383527 -0.374088 -0.354572 0.331817 0.190988 -0.238879 -0.257306 -0.668423 -0.537805 0.259622 0.264158 0.219927 0.247513 0.211049 0.238437 0.215956 0.189881 0.301412 0.262153 0.258611 0.247100 0.339993 0.388306 0.230567 0.228052 0.244967 0.234158 0.217484 0.250103 0.224201 0.231946
chargesum: 0.00000
title: Mulliken charges with hydrogens summed into heavy atoms:
elementType: O O O O O N N C C C C C C C C C C C C C C C C C
charge: -0.098804 -0.078524 -0.262630 -0.255870 -0.330131 -0.161891 -0.042132 0.071154 0.075075 0.327487 0.304476 0.118687 0.090936 -0.036360 -0.059019 -0.121374 -0.115477 -0.107472 0.331817 0.190988 -0.238879 0.201314 0.028186 0.168444
polarizability: 3.27191431e+02 2.40727804e+00 2.40184130e+02 -7.02531312e+00 1.05596990e+01 1.60768603e+02
1716.lowfreq: -9.5226 -7.9169 -3.6376 -0.0009 -0.0005 0.0002 20.1368 28.6749 33.3006
frequency: 19.1102 28.2905 33.2169 37.2957 49.7429 61.3138 76.5447 87.0446 97.9797 110.1019 114.7187 125.6077 136.1520 157.6883 164.9969 175.9554 180.8056 204.5095 217.6991 226.9569 232.3711 243.7620 288.5399 301.9104 311.4665 337.7319 351.5038 374.2867 386.3220 417.3285 423.8956 430.8893 458.2734 462.6884 508.1383 520.4150 534.6140 550.2267 572.2892 596.1469 625.2058 671.0087 703.8394 724.1364 745.7130 748.4585 764.1953 786.4437 813.3423 817.6731 824.0928 836.2920 856.9763 863.8093 888.0147 908.2565 959.3392 968.9064 980.6815 997.7519 1002.2778 1006.7676 1012.8742 1021.4722 1039.0425 1071.3339 1084.4367 1094.9910 1112.1646 1120.7177 1135.0059 1153.1323 1158.7412 1160.2866 1182.4774 1201.9152 1214.3462 1241.8564 1249.4793 1256.5289 1278.2218 1283.8999 1310.0662 1321.0226 1327.7054 1333.8461 1354.1298 1361.9105 1366.9465 1371.0701 1387.7096 1406.6341 1409.5574 1430.1422 1437.8776 1452.6049 1457.2412 1459.2477 1461.2658 1462.5701 1466.1892 1469.1529 1472.7772 1484.4551 1503.7373 1510.6274 1555.4199 1571.3443 1616.8718 2159.2419 2949.6658 2968.9890 2970.0180 2992.6964 3028.5226 3030.2745 3041.1824 3055.6493 3061.5351 3085.0283 3088.8323 3093.8149 3098.2149 3105.4173 3119.8005 3125.4037 3132.9993 3146.9576 3169.3851 3173.2251 3314.2563 3562.0586
redmass: 5.1285 3.7218 4.2686 4.0870 4.6295 5.3943 4.4064 4.5212 4.6542 3.6950 3.9840 4.0403 5.9810 4.6633 4.0172 2.9770 3.4022 3.8721 1.7412 2.0353 1.8292 2.5985 3.2574 4.3113 1.2461 3.8725 6.1508 2.4718 2.6877 4.6507 3.0876 3.6026 4.0561 4.2087 8.0101 4.4630 3.3462 3.8685 3.4145 3.1646 6.2899 6.0463 4.8459 4.7992 2.9886 1.2146 5.0928 3.4246 1.7015 2.4159 1.4578 2.3534 1.5650 2.2167 3.0460 3.0855 1.3704 2.4574 8.5124 2.6785 1.4467 1.6521 2.6842 4.1518 2.7287 1.8958 4.9333 2.2302 1.2601 1.4367 2.0539 1.7638 1.5389 1.6658 1.2788 1.3666 1.3452 2.8131 2.6189 2.0748 1.1243 1.8119 1.2903 1.2818 1.2883 1.3002 1.3647 1.3632 3.4470 1.2032 1.2331 1.7786 1.5683 3.9105 1.2078 1.1775 1.1082 1.1031 1.0806 1.0903 1.5765 1.0510 1.2061 1.0526 2.3454 1.8854 6.8349 6.9911 6.1296 12.6254 1.0662 1.0329 1.0672 1.0359 1.0613 1.0595 1.0635 1.0946 1.1044 1.0960 1.0976 1.1027 1.1045 1.1015 1.1063 1.0919 1.1001 1.0887 1.0945 1.0954 1.0685 1.0663
irintensity: 0.1490 0.8109 2.0379 0.8830 0.9415 0.5816 5.0648 6.3539 3.0941 2.2284 3.0126 4.6025 1.3525 6.7118 6.8986 5.4729 3.1586 4.6850 0.4642 2.8661 5.0762 4.3412 11.2130 4.1333 188.4730 17.5566 5.2346 1.1155 13.6002 6.6205 1.9824 11.2867 2.5036 1.8156 10.2253 16.5013 3.4686 6.6119 21.3432 25.1254 1.5959 14.2993 3.1989 24.8802 20.0287 117.7402 3.5191 5.5979 0.8462 2.3712 21.5184 19.4596 46.6664 17.2451 25.1348 33.1374 0.8337 49.7541 56.3497 13.1301 41.9831 60.0505 38.2681 55.5591 8.8386 12.5563 393.0479 4.8101 0.2652 2.9814 53.0009 64.9970 25.6203 2.0071 187.4818 17.9732 64.9281 360.1523 98.9296 65.0377 6.5433 50.3791 0.9405 4.2644 12.9954 0.6983 4.4736 6.4536 31.4142 38.0101 25.3122 53.8840 257.3581 9.3863 8.9766 110.5969 6.8594 0.9163 6.3253 30.5996 297.6178 17.3161 35.2419 17.3207 10.6264 94.0021 279.8090 85.2518 224.8395 65.0780 47.8348 81.2722 48.7001 21.9864 19.1423 36.9600 21.1284 79.2985 39.1921 22.8457 41.6460 1.8033 23.8501 6.3138 31.2688 1.7189 23.9987 3.5856 4.1017 10.8648 255.6568 5.4581
temp: 298.150 k
press: 1.00000 atm
elementType: 8 8 8 8 8 7 7 6 6 6 6 6 6 6 6 6 6 6 6 6 6 6 6 6 1 1 1 1 1 1 1 1 1 1 1 1 1 1 1 1 1 1 1 1 1 1
symmnumber: 1
zpe: 965445.8 jmol-1
zpe.correction: 0.367719 hartree
zpe.thermalcorrener: 0.393208 hartree
zpe.thermalcorrenthalpy: 0.394152 hartree
zpe.thermalcorrgfe: 0.310344 hartree
zpe.sumelectzpe: -1144.762806 hartree
zpe.sumelectthermal: -1144.737317 hartree
zpe.sumelectthermalent: -1144.736373 hartree
zpe.sumelectthermalfe: -1144.820181 hartree
dipole: -1.5659 1.5641 2.4418
dipole: 3.2956
quadrupole: -119.0265 -134.9929 -152.5722
quadrupole: 4.9554 -17.0660 -18.5672
quadrupole: 16.5040 0.5376 -17.0417 4.9554 -17.0660 -18.5672
hfenergy: -1145.1305251 hartree
pointgroup: C01 [X(C17H22N2O5)]
dipole: -0.6497801 -0.7151199 -0.8645946 debye
polarizability: 327.2473277|-3.7695665|241.7033422|4.4809187|0.1465082|159.1934945 unknown
InChI: InChI=1S/C17H22N2O5/c1-3-24-17(22)15(12-18)16(19(8-10-20)9-11-21)13-4-6-14(23-2)7-5-13/h4-7,20-21H,3,8-11H2,1-2H3
charge 0 multiplicity 1
46 atoms
O  -0.150203 -3.473002 2.444347
O  2.323908 -2.613163 -1.859109
O  3.164799 1.809585 0.562786
O  -5.469436 0.592602 -0.054242
O  3.038933 -0.249981 -0.509701
N  0.568378 -1.663992 0.218523
N  0.222272 2.912979 1.766273
C  1.598521 -2.247346 1.117701
C  0.039642 -2.564147 -0.840269
C  0.152335 -0.348526 0.323133
C  -1.298703 -0.08049 0.169111
C  0.992792 -2.545275 2.504054
C  0.903591 -2.428209 -2.123142
C  1.070508 0.706028 0.609834
C  -2.247308 -0.980171 0.747196
C  -1.777793 1.075176 -0.499657
C  -3.621406 -0.725895 0.655765
C  -3.15664 1.337644 -0.606181
C  -4.0837 0.434379 -0.023184
C  2.472459 0.663942 0.174319
C  0.60571 1.912802 1.228352
C  4.562255 1.96232 0.055839
C  4.567901 2.598567 -1.337013
C  -6.011005 1.796806 -0.697021
H  1.979286 -3.165911 0.639457
H  2.466289 -1.57995 1.232023
H  0.06989 -3.600246 -0.463607
H  -1.008883 -2.315169 -1.072904
H  1.789733 -2.933199 3.173404
H  0.579782 -1.624659 2.947716
H  0.612136 -3.215934 -2.841023
H  0.705761 -1.437319 -2.587048
H  -1.885659 -1.860188 1.294071
H  -1.062195 1.77241 -0.947574
H  -4.357698 -1.39363 1.11227
H  -3.494284 2.236024 -1.130259
H  0.175201 -4.374499 2.193596
H  2.67176 -1.784217 -1.411278
H  5.047208 0.970507 0.047884
H  5.032702 2.613535 0.809534
H  4.101459 1.926702 -2.076943
H  4.025151 3.55929 -1.330597
H  5.609744 2.790614 -1.654446
H  -7.100745 1.71834 -0.57527
H  -5.755464 1.824543 -1.773515
H  -5.642383 2.713627 -0.199409
