program: Gaussian 09
title: 000261219
version: EM64L-G09RevD.01
frameworkgroup: C1[X(C9H15N3O2)]
method: RPBEPBE
basis: SDD
operation: Freq
keyword: #p
keyword: freq=noraman
keyword: PBEPBE/SDD
title: #p freq=noraman PBEPBE/SDD
converged: YES YES NO NO
title: Mulliken charges:
elementType: O O N N N C C C C C C C C C H H H H H H H H H H H H H H H
charge: -0.271280 -0.248491 -0.418496 -0.161135 0.032230 -0.164505 -0.119881 -0.506284 -0.026770 -0.536382 -0.468825 -0.456356 0.314300 -0.626066 0.259201 0.236319 0.230598 0.221421 0.260407 0.227996 0.220728 0.213430 0.229042 0.229040 0.204881 0.338700 0.275874 0.255235 0.255070
chargesum: 0.00000
title: Mulliken charges with hydrogens summed into heavy atoms:
elementType: O O N N N C C C C C C C C C
charge: -0.271280 -0.248491 -0.079797 -0.161135 0.032230 0.094696 0.116438 -0.054266 0.233637 -0.087659 -0.026353 -0.022434 0.314300 0.160113
polarizability: 1.56150911e+02 -6.05758895e+00 1.23015756e+02 3.84860866e+00 -1.19451609e+00 8.90836283e+01
1716.lowfreq: -19.9606 -0.0006 -0.0006 -0.0005 6.9606 10.7067 23.2673 42.5016 65.4472
frequency: 20.2409 40.2877 65.3501 92.1393 135.9291 144.5052 189.7001 229.4899 245.3678 311.1342 328.1492 349.3123 392.9560 400.5298 435.6356 469.0589 531.5916 591.9373 664.5563 704.4061 727.3619 758.9273 767.6950 796.3416 827.7572 835.4350 873.4855 883.1774 908.2853 925.6218 936.5349 948.2222 950.4720 963.7614 1012.9952 1026.5569 1049.2736 1083.0420 1109.2367 1116.0694 1127.4980 1134.7188 1157.8275 1176.4039 1197.9774 1204.6388 1215.9491 1246.2119 1265.4687 1266.2272 1273.0675 1284.2027 1297.4889 1308.1229 1316.9162 1353.9882 1358.8939 1412.7332 1463.1179 1464.3791 1465.4871 1470.1585 1474.4162 1488.5862 1495.1605 1662.7187 2992.9330 2998.0320 3004.5738 3004.7360 3012.9344 3042.7711 3051.2105 3065.7852 3067.3313 3074.5470 3078.2003 3083.8701 3089.3404 3146.7084 3495.9195
redmass: 4.3553 3.6500 4.2779 4.5460 3.8018 1.1222 5.3438 5.5488 2.3459 3.6808 3.4926 3.7087 4.9884 2.4341 2.0963 5.5523 4.4204 3.1598 1.1368 10.9412 5.2457 3.2737 4.4963 1.5710 4.5623 2.4880 1.8869 2.5087 2.4851 2.8702 2.1529 2.4238 2.0745 1.6366 1.5505 1.8103 1.7585 2.5860 1.1043 1.3262 1.5040 1.1421 2.3453 2.0532 2.1776 1.8535 1.3027 1.4583 2.2869 1.3842 1.9879 1.4733 1.5736 1.4430 1.6248 2.2336 2.3759 1.1871 1.0437 1.1284 1.1423 1.0865 1.1043 1.4164 1.2045 10.2611 1.0641 1.0587 1.0593 1.0340 1.0623 1.0887 1.1038 1.1008 1.0894 1.1036 1.1032 1.0933 1.1009 1.1010 1.0773
irintensity: 0.0098 0.0436 0.0010 12.2642 2.2402 0.9786 2.2526 12.2685 2.6612 3.8127 3.0773 20.5155 1.5954 1.4694 0.4761 3.1225 8.3674 1.8122 73.4469 18.7409 27.2805 5.7868 11.5195 1.1248 17.0367 6.2625 16.2417 11.1599 115.9714 2.5263 7.1809 73.1016 43.3240 0.8713 7.1553 10.0627 1.5465 18.0253 0.0739 0.3971 34.2593 4.4549 12.5108 34.3641 5.0373 0.9817 9.1819 5.1463 0.6658 3.2781 18.3520 1.6138 15.2266 4.1539 3.6986 111.1133 51.3156 39.2205 20.8919 30.3705 50.5991 20.4550 34.4317 318.7237 81.4478 240.8954 38.8991 30.8264 44.2417 17.8403 52.5899 1.7608 2.2223 10.9530 64.7157 45.2086 73.1374 20.7946 14.2935 0.2748 37.3598
temp: 298.150 k
press: 1.00000 atm
elementType: 8 8 7 7 7 6 6 6 6 6 6 6 6 6 1 1 1 1 1 1 1 1 1 1 1 1 1 1 1
symmnumber: 1
zpe: 631830.3 jmol-1
zpe.correction: 0.240651 hartree
zpe.thermalcorrener: 0.253972 hartree
zpe.thermalcorrenthalpy: 0.254916 hartree
zpe.thermalcorrgfe: 0.199112 hartree
zpe.sumelectzpe: -665.525685 hartree
zpe.sumelectthermal: -665.512365 hartree
zpe.sumelectthermalent: -665.511420 hartree
zpe.sumelectthermalfe: -665.567224 hartree
dipole: -2.4328 -0.0811 -0.1155
dipole: 2.4369
quadrupole: -82.0764 -92.9557 -81.6350
quadrupole: 8.9254 -0.4594 1.7911
quadrupole: 3.4793 -7.4000 3.9207 8.9254 -0.4594 1.7911
hfenergy: -665.7663361 hartree
pointgroup: C01 [X(C9H15N3O2)]
dipole: -0.9582844 -0.0047533 -0.029381 debye
polarizability: 156.2260642|-5.6892704|106.1072985|-3.3501752|17.1292248|105.9169327 unknown
InChI: InChI=1S/C9H15N3O2/c1-12(11-14)9(13)10-8-5-6-2-3-7(8)4-6/h6-8,10H,2-5H2,1H3
charge 0 multiplicity 1
29 atoms
O  1.337438 1.635888 1.159395
O  3.983402 -1.265469 -1.241914
N  0.414744 0.153986 -0.410116
N  2.759954 0.182217 -0.038031
N  2.804814 -0.830929 -0.988659
C  -1.732118 -0.260838 0.89617
C  -2.998107 -0.631216 -0.96724
C  -2.246926 -1.489849 0.093562
C  -0.987472 0.563548 -0.208895
C  -1.850208 0.281689 -1.492732
C  -3.061033 0.491532 1.210944
C  -3.93873 0.227599 -0.069459
C  1.439044 0.721383 0.295675
C  3.9737 0.700569 0.613037
H  -1.103705 -0.457335 1.778668
H  -3.51956 -1.185274 -1.764614
H  -2.918488 -2.139883 0.681844
H  -1.438341 -2.110171 -0.33533
H  -0.971202 1.632091 0.066261
H  -1.25066 -0.245677 -2.259614
H  -2.225129 1.211714 -1.953557
H  -2.889463 1.567228 1.397236
H  -3.536177 0.072559 2.115795
H  -4.857764 -0.331649 0.182952
H  -4.246587 1.161477 -0.57354
H  0.655084 -0.590763 -1.071954
H  3.657567 1.482368 1.317714
H  4.661371 1.113139 -0.145316
H  4.496151 -0.115132 1.141916
