program: Gaussian 09
title: 000261231
version: EM64L-G09RevD.01
frameworkgroup: C1[X(C10H18N6O4)]
method: RPBEPBE
basis: SDD
operation: Freq
keyword: #p
keyword: freq=noraman
keyword: PBEPBE/SDD
title: #p freq=noraman PBEPBE/SDD
converged: YES YES NO YES
title: Mulliken charges:
elementType: O O O O N N N N N N C C C C C C C C C C H H H H H H H H H H H H H H H H H H
charge: -0.271864 -0.271864 -0.244519 -0.244519 -0.416151 -0.416159 -0.161599 -0.161599 0.030921 0.030921 -0.027079 -0.027065 -0.489183 -0.437837 -0.489193 -0.437856 0.335702 0.335706 -0.625579 -0.625580 0.262287 0.262286 0.211406 0.234412 0.249770 0.215215 0.211408 0.234413 0.215215 0.249785 0.344905 0.344908 0.256500 0.276267 0.256424 0.256424 0.256501 0.276268
chargesum: 0.00000
title: Mulliken charges with hydrogens summed into heavy atoms:
elementType: O O O O N N N N N N C C C C C C C C C C
charge: -0.271864 -0.271864 -0.244519 -0.244519 -0.071246 -0.071251 -0.161599 -0.161599 0.030921 0.030921 0.235209 0.235221 -0.043364 0.027148 -0.043373 0.027144 0.335702 0.335706 0.163613 0.163613
polarizability: 2.20691945e+02 1.97443535e+01 1.54809427e+02 2.53257427e-03 4.26006242e-03 1.32530520e+02
1716.lowfreq: -0.0010 -0.0009 -0.0007 3.3221 6.1446 17.1854 22.8803 26.5483 29.6446
frequency: 22.8677 26.5026 29.6420 42.5020 63.0334 89.0137 94.4036 102.4418 137.5831 137.9375 147.3451 160.5233 176.8553 201.1661 226.0334 252.0784 258.9578 314.7439 317.6522 325.4445 360.2421 363.1367 390.5868 392.7957 413.7751 433.4701 457.0874 486.0799 489.0158 501.9115 598.4847 662.1940 662.2444 683.9678 708.0707 716.7339 740.6972 748.4172 772.5073 794.9673 822.8823 844.9204 862.7786 881.3626 913.4126 924.9986 940.4279 976.1781 997.1831 1013.8828 1049.8582 1054.0820 1112.6808 1115.8657 1115.9068 1117.7016 1136.4790 1145.4731 1166.0729 1171.9722 1195.6654 1196.2460 1244.8814 1263.5587 1267.3059 1283.9829 1296.2735 1317.6852 1328.5921 1338.1149 1354.0249 1358.3493 1359.3904 1360.3946 1366.3857 1377.8266 1413.5031 1413.5468 1462.5192 1462.5687 1463.5557 1464.6908 1467.7777 1468.4579 1473.3256 1474.7387 1485.9379 1502.4957 1661.6942 1664.0110 2986.9729 2989.0870 2990.7051 2992.1073 3005.5881 3005.6161 3024.1036 3025.3688 3041.4103 3050.3435 3059.4465 3063.6563 3090.4707 3090.4774 3147.5510 3147.5516 3499.1624 3499.2244
redmass: 8.1996 6.8280 5.2577 3.7325 8.0670 3.6738 4.3487 5.3287 1.1850 1.1911 4.0298 4.9367 4.2229 5.9089 5.1584 3.9104 5.8780 3.2695 3.4587 3.0831 2.4830 3.3337 5.8249 5.9395 2.8886 4.2835 3.5318 6.6124 3.9902 4.3257 3.9458 1.1176 1.1091 2.9373 10.7884 5.0919 5.2469 5.1578 1.5146 4.6957 5.4564 4.6107 2.6623 2.6856 2.3098 2.6559 2.9938 1.7538 3.4269 2.5933 1.4807 1.8702 1.7032 1.3274 1.3329 1.8382 2.5744 2.1837 2.3967 1.1066 2.3358 2.3706 1.4024 2.6061 3.0618 1.4881 2.2171 1.4348 1.6490 1.3518 1.2641 1.4107 8.0152 8.7855 1.5287 1.3492 1.1882 1.1892 1.0438 1.0446 1.1507 1.0776 1.1662 1.1158 1.1206 1.1068 1.6370 1.5718 9.6626 10.3465 1.0606 1.0657 1.0671 1.0618 1.0335 1.0335 1.0844 1.0861 1.0979 1.1021 1.0964 1.1016 1.1009 1.1009 1.1010 1.1010 1.0770 1.0769
irintensity: 0.0534 0.3227 0.1952 0.0597 0.0108 2.8149 12.4766 8.5920 1.8089 1.2113 5.1015 1.1820 0.0116 2.2733 0.1250 2.4620 48.8400 0.7074 29.2835 2.8174 1.4235 7.8953 2.6301 1.7488 0.2454 1.5613 0.5775 1.5388 3.6271 4.8039 0.1667 86.2818 87.0706 15.0919 22.4317 11.7827 4.9101 82.1039 0.2668 0.0171 22.2879 16.4811 0.0845 71.1198 4.5930 408.2939 15.0970 15.1699 19.5077 18.1456 2.4944 0.3030 1.8810 0.4399 0.7731 23.1732 131.2314 0.0443 15.7675 0.5962 3.1043 8.2540 60.2864 0.0096 6.1651 0.3116 35.0544 0.0126 0.0241 1.5266 13.6443 0.3916 280.9005 32.4764 2.8622 3.6157 41.2718 31.1862 12.6930 33.8888 55.8349 4.1148 155.5328 3.0333 0.1470 42.4634 933.7755 7.8202 306.1171 160.7710 16.5523 22.0453 1.2601 30.5143 26.5993 2.1066 49.6330 1.9874 35.7887 54.5867 11.6974 49.6759 11.2028 14.4408 0.2651 0.2622 24.6901 47.5032
temp: 298.150 k
press: 1.00000 atm
elementType: 8 8 8 8 7 7 7 7 7 7 6 6 6 6 6 6 6 6 6 6 1 1 1 1 1 1 1 1 1 1 1 1 1 1 1 1 1 1
symmnumber: 1
zpe: 791710.0 jmol-1
zpe.correction: 0.301546 hartree
zpe.thermalcorrener: 0.322325 hartree
zpe.thermalcorrenthalpy: 0.323269 hartree
zpe.thermalcorrgfe: 0.249690 hartree
zpe.sumelectzpe: -1019.634843 hartree
zpe.sumelectthermal: -1019.614065 hartree
zpe.sumelectthermalent: -1019.613121 hartree
zpe.sumelectthermalfe: -1019.686700 hartree
dipole: 0.0000 -0.0002 0.6382
dipole: 0.6382
quadrupole: -127.5162 -134.1527 -118.0738
quadrupole: -11.1538 -0.0042 -0.0047
quadrupole: -0.9353 -7.5718 8.5071 -11.1538 -0.0042 -0.0047
hfenergy: -1019.9363896 hartree
pointgroup: C01 [X(C10H18N6O4)]
dipole: 0.0000199 -0.0000815 -0.2510992 debye
polarizability: 220.9247669|-19.3506175|154.5766052|0.0025579|-0.0042449|132.5305197 unknown
InChI: InChI=1S/C10H18N6O4/c1-15(13-19)9(17)11-7-3-5-8(6-4-7)12-10(18)16(2)14-20/h7-8,11-12H,3-6H2,1-2H3
charge 0 multiplicity 1
38 atoms
O  3.40179 1.878037 1.142063
O  -3.402059 -1.877613 1.142579
O  5.645506 -1.675063 -0.738449
O  -5.645256 1.674931 -0.739607
N  2.352097 0.42646 -0.371241
N  -2.352166 -0.426963 -0.371476
N  4.625245 0.082582 0.218076
N  -4.625258 -0.082438 0.217711
N  4.553974 -1.013652 -0.635468
N  -4.553893 1.013255 -0.636516
C  1.034682 1.104907 -0.341014
C  -1.034822 -1.105529 -0.34085
C  0.241688 0.73668 -1.618681
C  0.227171 0.737418 0.934213
C  -0.241599 -0.737724 -1.618493
C  -0.227472 -0.737718 0.934382
C  3.405389 0.876195 0.374915
C  -3.40555 -0.876226 0.374836
C  5.85889 0.439249 0.936991
C  -5.85885 -0.43837 0.937078
H  1.235445 2.192339 -0.326184
H  -1.235666 -2.192944 -0.325729
H  -0.625094 1.423461 -1.684201
H  0.85716 0.933099 -2.516709
H  0.840163 0.957422 1.826332
H  -0.65697 1.403852 0.982903
H  0.625186 -1.424534 -1.683655
H  -0.856918 -0.934419 -2.516567
H  0.656653 -1.404153 0.983356
H  -0.840581 -0.957482 1.82648
H  2.508635 -0.40508 -0.949296
H  -2.508587 0.404315 -0.94994
H  6.668447 0.648089 0.216518
H  5.63867 1.329513 1.542502
H  6.178093 -0.400618 1.577845
H  -6.177211 0.401547 1.578296
H  -6.668831 -0.646428 0.216864
H  -5.638999 -1.328895 1.542338
