program: Gaussian 09
title: 000261170
version: EM64L-G09RevD.01
frameworkgroup: C1[X(C3H7ClN2OS)]
method: RPBEPBE
basis: SDD
operation: Freq
keyword: #p
keyword: freq=noraman
keyword: PBEPBE/SDD
title: #p freq=noraman PBEPBE/SDD
converged: YES YES NO NO
title: Mulliken charges:
elementType: Cl S O N N C C C H H H H H H H
charge: -0.064066 0.618749 -0.573619 -0.019563 -0.357495 -0.269408 -0.569507 -0.628510 0.252838 0.252788 0.292946 0.292631 0.262554 0.262538 0.247124
chargesum: 0.00000
title: Mulliken charges with hydrogens summed into heavy atoms:
elementType: Cl S O N N C C C
charge: -0.064066 0.618749 -0.573619 -0.019563 -0.357495 0.236218 0.016070 0.143706
polarizability: 1.36442138e+02 -2.56993057e+01 8.60710260e+01 -2.09946083e-03 -1.05125605e-02 4.27100007e+01
1716.lowfreq: -20.4693 -7.4472 -3.7628 -0.0004 0.0032 0.0035 45.0351 66.7937 85.2329
frequency: 44.4259 66.7680 85.2229 100.0726 158.1415 193.1234 198.3133 234.4078 289.6498 326.1775 410.4742 448.2948 669.4454 702.4101 788.9907 856.7471 865.8567 1005.6295 1017.8601 1085.5742 1092.0275 1153.5122 1188.7259 1240.5606 1269.0115 1282.1765 1379.2441 1433.3955 1450.1445 1453.9795 1472.3517 1478.6379 2952.3433 2979.9707 3024.9288 3033.7195 3097.6647 3115.7498 3185.3295
redmass: 1.9470 4.7235 10.9705 3.7758 2.6791 1.5466 4.4444 13.9438 6.3314 5.2109 5.4014 4.5420 9.2885 6.5221 1.1209 7.1498 9.6114 1.2933 2.2634 1.2666 2.7235 1.2151 3.1800 1.6741 1.1240 2.0768 1.4751 1.2199 1.0413 1.0972 1.0687 1.1095 1.0360 1.0577 1.1006 1.1057 1.0573 1.0985 1.1120
irintensity: 1.3180 0.2277 8.8606 3.8894 8.5392 4.5469 0.3394 2.1866 1.1373 0.4622 3.6253 4.4185 76.0912 7.8048 4.5685 48.8611 40.0354 0.4276 23.5031 0.5506 14.9295 0.3417 88.3289 47.2242 1.4741 51.1100 9.4309 5.6391 20.8847 3.6985 17.0973 20.5239 17.0347 26.7124 17.0869 14.3340 8.2886 7.4089 4.4981
temp: 298.150 k
press: 1.00000 atm
elementType: 17 16 8 7 7 6 6 6 1 1 1 1 1 1 1
symmnumber: 1
zpe: 280111.9 jmol-1
zpe.correction: 0.106689 hartree
zpe.thermalcorrener: 0.117006 hartree
zpe.thermalcorrenthalpy: 0.117950 hartree
zpe.thermalcorrgfe: 0.068973 hartree
zpe.sumelectzpe: -1160.601168 hartree
zpe.sumelectthermal: -1160.590851 hartree
zpe.sumelectthermalent: -1160.589907 hartree
zpe.sumelectthermalfe: -1160.638884 hartree
dipole: -1.8230 6.5675 0.0002
dipole: 6.8158
quadrupole: -81.0858 -61.5905 -60.5546
quadrupole: 10.6549 -0.0194 -0.0045
quadrupole: -13.3422 6.1531 7.1890 10.6549 -0.0194 -0.0045
hfenergy: -1160.7078567 hartree
pointgroup: C01 [X(C3H7Cl1N2O1S1)]
dipole: 1.0910598 2.438934 0.2276943 debye
dipolederiv: -0.6401672 0.1396235 0.0193518 0.1013979 -0.2117711 -0.005368 0.0149772 -0.0055692 -0.1720505 0.290104 0.0197586 0.0016422 0.8713494 0.4101661 0.0018345 0.087011 0.0134643 0.271719 -0.625315 0.0590465 0.0092356 -0.651212 -0.5026692 -0.0024231 -0.0621247 -0.0123387 -0.388727 -0.9617347 -0.166841 -0.0055631 -0.6698048 -0.4707318 -0.0215307 -0.0510787 -0.0264677 -0.1644589 0.582091 0.2485606 0.0129878 0.8481164 0.1159844 0.0220779 0.0722238 0.0304398 -0.2204138 0.5933826 0.0099991 -0.0028101 -0.3840343 0.0310117 -0.020769 -0.0449485 -0.0263145 0.2809717 0.8912732 -0.1600761 -0.0239424 -0.0920699 0.1262421 -0.0039341 -0.0161905 -0.0033941 0.179202 0.0141733 -0.0784476 -0.005641 0.1021715 0.22865 0.0003714 0.0115714 0.0020948 0.2146337 -0.0845721 -0.0383455 -0.033385 0.0198991 0.0573424 -0.0704333 -0.068327 -0.0788556 -0.0515997 -0.0809752 -0.0420727 0.0268362 0.006827 0.0230767 0.0856684 0.071714 0.0953301 -0.0197325 -0.0201576 -0.0228206 0.0415634 0.0108026 0.0454017 0.0456347 0.0482685 0.055014 0.0130225 -0.0225415 -0.0147994 -0.0450023 0.0197829 0.0636783 -0.0357865 -0.044884 -0.0445892 -0.0042277 0.0444361 0.0742198 0.1049855 -0.054817 0.0314686 0.0303873 0.0445263 -0.0435436 -0.0404205 0.0395187 0.0953205 -0.090617 -0.0447175 0.0271407 -0.0161298 -0.0569776 0.0536564 -0.030186 -0.0195155 -0.1231258 -0.0096415 -0.0836913 0.0250092 -0.0095996 -0.0057612 -0.0089268 0.1322678 unknown
polarizability: 142.8377112|17.2562737|79.3407175|0.4248279|3.4206853|43.0447362 unknown
InChI: InChI=1S/C3H7ClN2OS/c1-6(3-2-4)5-8-7/h2-3H2,1H3
charge 0 multiplicity 1
15 atoms
Cl 3.647367 -1.128211 -0.189844
S  -2.539295 0.159615 0.016661
O  -3.26183 -1.314037 -0.121165
N  0.056028 0.896089 0.052955
N  -0.772226 -0.16243 -0.041141
C  1.512582 0.598952 0.006527
C  1.772645 -0.904393 -0.149255
C  -0.396372 2.289895 0.199625
H  1.985105 0.96769 0.938129
H  1.965054 1.149391 -0.841609
H  1.403356 -1.493562 0.698697
H  1.387064 -1.311237 -1.091881
H  -1.001521 2.40109 1.122086
H  -1.029872 2.578879 -0.663323
H  0.474014 2.96117 0.252638
