program: Gaussian 09
title: 000261164
version: EM64L-G09RevD.01
frameworkgroup: C1[X(C15H12O6)]
method: RPBEPBE
basis: SDD
operation: Freq
keyword: #pfreq=noraman
keyword: PBEPBE/SDD
title: #p freq=noraman PBEPBE/SDD
converged: YES YES NO NO
title: Mulliken charges:
elementType: O O O O O O C C C C C C C C C C C C C C C H H H H H H H H H H H H
charge: -0.468841 -0.481759 -0.420836 -0.232296 -0.428744 -0.472144 0.293189 0.019498 0.542112 0.037680 -0.370089 0.014378 -0.271110 0.175194 -0.430299 -0.350902 -0.497211 -0.398066 0.163375 0.141882 -0.339786 0.274879 0.275018 0.289949 0.257160 0.266244 0.233693 0.227234 0.396797 0.399175 0.387523 0.387643 0.379460
chargesum: 0.00000
title: Mulliken charges with hydrogens summed into heavy atoms:
elementType: O O O O O O C C C C C C C C C C C C C C C
charge: -0.072043 -0.082585 -0.033313 -0.232296 -0.041101 -0.092685 0.293189 0.019498 0.542112 0.037680 -0.095210 0.014378 0.003908 0.175194 -0.140350 -0.093743 -0.230967 -0.164373 0.163375 0.141882 -0.112552
polarizability: 4.15964731e+02 1.05026929e+01 1.87612547e+02 -1.31647716e+01 7.40599634e+00 9.46418717e+01
1716.lowfreq: -3.1615 -2.5589 -0.0010 -0.0003 0.0002 5.3445 18.5062 32.5560 35.1162
frequency: 18.1947 32.5505 35.1079 71.0122 97.6883 104.4790 156.0594 171.6636 182.8194 222.2068 236.2603 256.9058 267.4958 275.2149 281.8074 306.1258 308.6584 315.2115 361.5372 363.4728 420.2465 430.1638 441.3207 447.0645 461.1685 480.1539 494.4827 503.8984 528.1952 546.8773 560.8366 573.3186 585.8124 603.5842 624.7171 684.1151 708.5069 723.8603 728.6524 755.3579 764.1123 791.0910 817.6673 829.4345 875.3946 903.3183 911.8142 919.7822 941.2909 953.2310 990.5668 1013.3986 1046.3766 1073.6720 1132.4712 1144.3198 1163.4592 1171.0150 1183.8866 1193.5542 1217.5120 1237.4049 1247.8101 1256.3299 1271.8114 1305.2802 1317.2536 1333.1754 1361.5915 1405.5306 1415.5831 1453.3117 1462.5069 1508.5750 1513.6039 1522.6538 1594.8328 1602.9212 1618.2026 1630.8456 1641.6598 3096.6615 3103.7005 3125.7422 3158.8487 3160.6003 3162.4309 3183.7928 3473.7261 3518.3585 3532.1326 3558.3414 3618.8283
redmass: 6.4908 6.9071 6.4145 6.2005 7.7515 6.0830 8.8407 5.2420 7.8401 5.2265 6.9784 3.5197 5.0240 5.2708 5.1145 1.3856 2.8707 5.9556 6.6912 3.7100 5.3810 1.1348 3.0883 5.4924 1.2760 1.1102 8.0269 1.1234 4.6047 5.2578 6.1118 4.7387 4.6156 3.6336 5.8996 5.5948 5.9228 4.5739 5.4894 5.0329 5.8203 1.4412 1.5417 5.2892 1.5879 4.4498 1.8170 1.3663 3.2980 1.3745 3.6955 1.1522 2.8863 2.1440 1.4087 1.2281 1.6251 1.4345 1.4526 1.5135 1.8593 2.1388 2.1359 2.2036 1.9788 1.7252 2.0424 1.5923 2.0623 5.4190 6.6912 4.7661 3.2697 3.4934 3.9981 8.8727 6.5697 6.8520 6.0513 6.4129 6.5366 1.0927 1.0863 1.0890 1.0929 1.0886 1.0944 1.0967 1.0665 1.0650 1.0650 1.0652 1.0667
irintensity: 0.7066 0.2896 0.6687 0.5995 3.3709 4.7564 0.1237 0.1395 0.8002 5.6565 1.6075 6.4610 0.7163 9.8113 3.4526 134.1718 38.9909 25.3583 0.9590 10.6362 12.8150 214.4401 11.2340 43.0762 109.9325 155.0925 2.9386 143.7130 10.7457 13.5247 26.0068 29.7819 21.8791 16.8152 34.2995 29.7686 5.3293 3.0151 6.5754 9.6063 28.1582 45.1210 30.4698 9.3401 21.8898 36.3745 2.7030 1.2100 24.8202 4.3867 64.1390 63.1203 231.3943 180.0528 53.4927 12.9065 248.7800 183.0353 64.6382 21.4197 53.7912 305.7095 134.0028 625.6669 256.5423 8.1915 56.1091 26.0091 2.8806 69.3992 13.0091 44.0118 44.5504 195.0685 6.7844 213.3169 214.7595 34.0764 419.5971 203.4266 32.6210 1.8222 10.0080 14.9520 6.5254 0.0437 1.5775 7.1261 262.5347 129.5835 105.7304 69.7562 118.5679
temp: 298.150 k
press: 1.00000 atm
elementType: 8 8 8 8 8 8 6 6 6 6 6 6 6 6 6 6 6 6 6 6 6 1 1 1 1 1 1 1 1 1 1 1 1
symmnumber: 1
zpe: 626832.6 jmol-1
zpe.correction: 0.238748 hartree
zpe.thermalcorrener: 0.257928 hartree
zpe.thermalcorrenthalpy: 0.258873 hartree
zpe.thermalcorrgfe: 0.190324 hartree
zpe.sumelectzpe: -1028.622652 hartree
zpe.sumelectthermal: -1028.603471 hartree
zpe.sumelectthermalent: -1028.602527 hartree
zpe.sumelectthermalfe: -1028.671076 hartree
dipole: -5.0738 -6.2971 -0.9974
dipole: 8.1481
quadrupole: -111.4601 -118.6433 -121.9505
quadrupole: 13.5061 8.9895 2.0001
quadrupole: 5.8912 -1.2920 -4.5992 13.5061 8.9895 2.0001
hfenergy: -1028.8613999 hartree
pointgroup: C01 [X(C15H12O6)]
dipole: -1.9593241 1.9231526 -1.6549867 debye
polarizability: 414.2611569|7.5647747|143.5219484|27.1286093|-46.5812702|140.4360449 unknown
InChI: InChI=1S/C15H12O6/c16-10(9-3-6-12(18)15(21)14(9)20)4-1-8-2-5-11(17)13(19)7-8/h1-7,17-21H
charge 0 multiplicity 1
33 atoms
O  1.799191 0.342485 -1.512527
O  4.343917 1.158674 -2.025318
O  6.365794 0.849838 -0.195392
O  0.939637 -1.834602 2.063596
O  -6.1601 -1.30224 -0.079148
O  -6.422627 1.225907 -0.996232
C  2.444043 -0.423986 0.812747
C  2.719188 0.168902 -0.453694
C  -2.614983 -0.172549 0.228991
C  1.085035 -0.884636 1.223849
C  3.537532 -0.608899 1.708548
C  4.021836 0.59283 -0.778017
C  -1.346085 -0.751612 0.676428
C  5.081992 0.430337 0.142891
C  -0.098524 -0.176845 0.646994
C  4.837312 -0.181676 1.395108
C  -3.783271 -0.988763 0.280989
C  -2.733777 1.165285 -0.250718
C  -5.027206 -0.490516 -0.135007
C  -5.121893 0.846196 -0.611729
C  -3.979378 1.671103 -0.668244
H  3.323303 -1.093778 2.665652
H  -1.389499 -1.771345 1.087459
H  0.048006 0.856383 0.302696
H  5.669497 -0.308482 2.092046
H  -3.728765 -2.019193 0.646941
H  -1.855917 1.817269 -0.2897
H  -4.062444 2.702782 -1.031971
H  0.930847 -0.097435 -1.310304
H  3.533384 1.172753 -2.596534
H  6.352572 1.233765 -1.112428
H  -6.946784 -0.790032 -0.404067
H  -6.464933 2.15908 -1.315009
