program: Gaussian 09
title: 000261091
version: EM64L-G09RevD.01
frameworkgroup: C1[X(C15H9Cl4NO)]
method: RPBEPBE
basis: SDD
operation: Freq
keyword: #p
keyword: freq=noraman
keyword: PBEPBE/SDD
title: #p freq=noraman PBEPBE/SDD
converged: YES YES NO NO
title: Mulliken charges:
elementType: Cl Cl Cl Cl O N C C C C C C C C C C C C C C C H H H H H H H H H
charge: 0.021035 0.003929 0.049261 -0.055599 -0.211481 -0.472042 0.159309 -0.703758 0.467442 0.194532 0.292194 0.533960 -0.448571 -0.312725 -0.403320 -0.374345 -0.171901 -0.243776 -0.106396 0.182499 -0.787385 0.264982 0.271266 0.252928 0.270116 0.256419 0.316423 0.236478 0.269886 0.248639
chargesum: 0.00000
title: Mulliken charges with hydrogens summed into heavy atoms:
elementType: Cl Cl Cl Cl O N C C C C C C C C C C C C C C C
charge: 0.021035 0.003929 0.049261 -0.055599 -0.211481 -0.155619 0.159309 -0.167510 0.467442 0.194532 0.292194 0.533960 -0.448571 -0.059797 -0.133204 -0.374345 -0.171901 0.012642 -0.106396 0.182499 -0.032382
polarizability: 3.37764329e+02 6.19193354e-01 2.45070041e+02 4.21184854e+00 -1.36555685e+01 9.80616744e+01
1716.lowfreq: -54.1598 -5.6768 -3.6246 -2.1121 0.0013 0.0022 0.0028 35.1561 49.3496
frequency: -54.1207 35.1535 49.3461 56.1409 66.8181 81.0820 91.4200 106.3304 127.6351 178.8930 184.7551 202.9195 222.9137 226.3821 238.5633 263.8586 284.2237 302.6919 331.4563 342.2267 363.1163 396.4547 412.8204 429.7572 466.0989 519.0722 528.9017 565.6027 573.3194 595.5769 609.8925 628.8195 652.1354 656.9890 683.1053 716.1235 735.9269 760.9447 781.8068 818.9079 852.6948 867.1074 869.8881 932.8028 942.8517 953.2111 968.6730 1024.3228 1030.5224 1054.0560 1069.5269 1127.0370 1132.5551 1185.6249 1205.9887 1226.0132 1241.2189 1271.4057 1287.3660 1334.3832 1362.9018 1376.3851 1393.2762 1409.3367 1419.8765 1423.8493 1443.7580 1464.4918 1465.1404 1475.0276 1567.0301 1581.8960 1592.2483 1612.5768 1646.6858 2990.5998 2992.1124 3038.1500 3076.4855 3135.5840 3160.6966 3168.1676 3199.4570 3501.6879
redmass: 1.0291 11.3564 7.8942 8.3637 3.9216 16.6373 5.2373 12.2574 9.4010 9.3484 11.8090 28.7466 3.4692 7.1241 8.6599 5.6040 5.0828 6.7987 23.1431 6.0188 5.8212 6.7253 9.9344 2.9967 4.8887 3.6270 5.0841 3.9116 2.3282 1.9066 4.8902 6.9019 7.8374 6.8445 6.5326 4.3938 6.4710 6.6304 4.3125 1.6814 4.6863 1.8772 3.1226 4.8845 1.5412 1.9435 1.9835 7.1106 1.7135 3.9940 2.0709 1.8964 1.1449 2.1366 1.6004 2.7881 5.2919 1.4700 4.9756 6.0256 7.9456 1.2421 5.2645 4.2055 2.1844 1.6401 1.3116 1.5871 1.5833 1.5988 10.3882 7.9390 8.7967 7.8125 6.3411 1.0382 1.0617 1.0985 1.0981 1.0985 1.0934 1.0904 1.0948 1.0762
irintensity: 0.0249 1.0584 0.8397 2.3315 7.6391 1.5105 0.1817 1.5771 3.4184 0.9650 1.2799 0.1269 4.4517 1.1132 0.2556 1.1600 2.1784 2.3340 0.3733 0.3019 0.5970 0.7609 34.6763 7.2783 18.3391 1.7465 5.1249 10.5993 13.0989 73.0763 0.2358 6.6822 7.2794 11.8744 5.7797 0.3337 31.6129 40.4621 15.0340 31.6931 33.8117 12.2878 19.9708 8.9331 5.0118 6.4205 33.6197 2.0484 6.4181 2.1593 25.9546 3.5018 0.3017 40.3346 20.1487 81.1082 76.2186 10.1965 30.8700 66.0776 20.4812 58.7206 33.6788 115.6589 20.6173 55.3687 120.1996 3.8323 39.0766 170.5758 12.1895 24.6422 6.4279 28.6076 119.0064 6.2037 2.9017 2.3452 10.9200 5.7496 1.6677 2.0340 6.8090 28.6682
temp: 298.150 k
press: 1.00000 atm
elementType: 17 17 17 17 8 7 6 6 6 6 6 6 6 6 6 6 6 6 6 6 6 1 1 1 1 1 1 1 1 1
symmnumber: 1
zpe: 522545.9 jmol-1
zpe.correction: 0.199027 hartree
zpe.thermalcorrener: 0.217747 hartree
zpe.thermalcorrenthalpy: 0.218691 hartree
zpe.thermalcorrgfe: 0.150444 hartree
zpe.sumelectzpe: -2545.773816 hartree
zpe.sumelectthermal: -2545.755096 hartree
zpe.sumelectthermalent: -2545.754152 hartree
zpe.sumelectthermalfe: -2545.822399 hartree
dipole: -0.4545 2.1146 -2.5153
dipole: 3.3173
quadrupole: -165.1518 -126.4398 -154.0154
quadrupole: -5.1410 -0.8469 -9.1381
quadrupole: -16.6161 22.0959 -5.4798 -5.1410 -0.8469 -9.1381
hfenergy: -2545.972843 hartree
pointgroup: C01 [X(C15H9Cl4N1O1)]
dipole: 0.1968954 0.7450541 1.0533254 debye
polarizability: 335.8045582|-10.2518456|243.471107|17.0275355|22.4688282|101.6203783 unknown
InChI: InChI=1S/C15H9Cl4NO/c1-6(21)20-15-11-9-3-2-8(16)4-7(9)5-10(11)12(17)13(18)14(15)19/h2-4,20H,5H2,1H3
charge 0 multiplicity 1
30 atoms
Cl 2.083589 -3.817996 -0.432418
Cl 3.930118 1.299659 0.887497
Cl 4.536966 -1.820775 0.347605
Cl -5.880596 -0.49959 -0.020788
O  -0.046072 2.557215 -1.368681
N  1.055505 2.088887 0.645977
C  0.185996 -0.208611 0.157962
C  -0.801642 -2.349598 -0.406027
C  0.474046 -1.579722 -0.127012
C  -1.282424 -0.040941 0.152461
C  -1.874444 -1.299477 -0.178704
C  1.247956 0.692688 0.430997
C  1.783339 -2.066532 -0.083444
C  -2.110293 1.066915 0.446161
C  -3.268492 -1.459039 -0.243343
C  2.568207 0.162415 0.493402
C  2.851986 -1.199868 0.25204
C  -3.513656 0.917146 0.397657
C  -4.065188 -0.33284 0.048136
C  0.493248 2.964394 -0.306413
C  0.606408 4.437355 0.077459
H  -0.91113 -3.223374 0.263876
H  -0.81402 -2.745683 -1.440214
H  -1.689541 2.036889 0.713376
H  -3.726912 -2.417842 -0.501934
H  -4.171257 1.761788 0.620047
H  1.639391 2.517583 1.370502
H  0.25172 4.622088 1.107782
H  0.005599 5.033566 -0.624179
H  1.657694 4.774696 0.011719
