program: Gaussian 09
title: 000261103
version: EM64L-G09RevD.01
frameworkgroup: C1[X(C22H15Cl2N3O)]
method: RPBEPBE
basis: SDD
operation: Freq
keyword: #p
keyword: freq=noraman
keyword: PBEPBE/SDD
title: #p freq=noraman PBEPBE/SDD
converged: YES YES NO NO
title: Mulliken charges:
elementType: Cl Cl O N N N C C C C C C C C C C C C C C C C C C C C C C H H H H H H H H H H H H H H H
charge: -0.047829 -0.057343 -0.227899 -0.352824 -0.039398 -0.077154 0.180792 0.463729 0.109627 0.121381 0.039255 -0.331785 -0.329333 -0.287020 -0.766776 -0.335358 0.250503 -0.366178 -0.339069 -0.131997 -0.186768 0.505831 -0.353583 -0.281008 -0.358932 -0.230170 -0.227967 -0.214396 0.253740 0.251288 0.295091 0.251766 0.250069 0.267886 0.266445 0.257502 0.249520 0.260778 0.244329 0.285395 0.259868 0.238205 0.239785
chargesum: 0.00000
title: Mulliken charges with hydrogens summed into heavy atoms:
elementType: Cl Cl O N N N C C C C C C C C C C C C C C C C C C C C C C
charge: -0.047829 -0.057343 -0.227899 -0.352824 -0.039398 -0.077154 0.180792 0.463729 0.109627 0.121381 0.039255 -0.078044 -0.078045 0.008071 0.002946 -0.068912 0.250503 -0.108676 -0.089550 -0.131997 0.074010 0.505831 -0.109254 -0.281008 -0.073537 0.029699 0.010237 0.025389
polarizability: 5.82471560e+02 1.29564196e+01 2.36486265e+02 -4.69776607e+00 -1.37460883e+01 1.80830726e+02
1716.lowfreq: -7.3892 -3.7609 -2.1481 -0.0024 -0.0012 -0.0009 6.9646 17.5538 20.8316
frequency: 5.4825 17.5008 20.7206 30.9777 47.6340 60.9162 68.3373 114.2241 121.5791 136.4938 150.0289 154.3140 160.5871 168.5595 184.6264 197.9544 232.5226 258.6627 281.2940 290.4775 335.0117 356.3318 359.4789 375.4932 383.1229 397.4423 412.0018 415.1273 452.9466 455.5584 488.9301 508.9613 519.3419 528.0442 544.1646 547.0354 558.1866 593.8679 620.5304 631.2981 641.3855 661.1219 669.1809 695.5430 701.4751 722.5987 738.1001 769.2467 786.7463 815.7335 824.3184 836.7025 840.9723 844.3655 859.4753 879.8567 883.0619 922.5745 952.0431 965.1358 971.2258 971.4449 984.7170 989.7112 1001.8785 1004.9781 1014.2875 1020.4241 1035.9720 1045.9612 1061.4489 1081.3888 1108.7208 1115.1994 1116.5622 1165.5776 1170.9911 1188.6033 1197.9962 1224.7944 1232.3499 1243.3704 1271.6915 1278.1163 1293.9090 1308.1899 1343.1063 1361.4146 1388.2590 1392.6660 1395.9390 1412.4902 1414.0422 1426.5472 1448.0717 1452.9893 1458.2408 1462.3104 1490.8939 1553.2694 1561.4886 1562.3659 1570.0315 1586.1891 1606.0969 1606.6927 1618.3468 1621.6988 2998.1115 3003.7804 3076.6932 3134.9371 3138.1254 3140.5854 3146.1861 3153.8901 3159.5654 3159.6623 3166.8557 3170.8192 3171.3405 3178.4613 3179.6211
redmass: 8.1860 7.5403 7.9150 4.3761 8.0697 7.2349 4.9666 5.4405 6.2829 6.2610 2.6660 1.8172 5.0118 6.4047 4.6749 3.4922 5.2240 6.1787 3.9594 5.0921 7.4354 5.4462 5.6013 7.7668 7.2042 6.5198 3.9202 3.4795 3.7470 3.4912 4.4058 6.2079 5.1973 5.1254 4.0780 4.0584 5.4366 5.4853 4.7939 4.8611 6.0788 6.9985 6.7113 6.1171 6.9968 3.9629 3.8488 1.2456 3.8064 3.3243 2.0678 1.6262 1.6194 4.1175 4.3088 1.6636 2.6001 1.4410 1.4096 1.3700 1.3492 1.3683 1.7034 3.0504 2.5976 1.4339 6.8776 2.5565 2.0130 1.5487 2.0817 3.6368 1.3068 1.7743 1.6117 1.4934 1.0695 1.7436 3.1287 1.9531 1.8749 3.8161 2.1186 1.7941 1.3318 5.0659 2.3433 5.1688 9.9468 2.9859 1.3027 3.8400 3.9492 2.3379 1.3067 2.1421 2.5810 1.0490 2.7742 8.1597 7.0335 6.5431 7.4167 6.2900 7.3166 7.9003 8.0489 8.5657 1.0382 1.0874 1.0969 1.0990 1.0880 1.0861 1.0893 1.0905 1.0971 1.0887 1.0958 1.0931 1.0970 1.0997 1.0979
irintensity: 0.5495 0.3774 0.7306 0.5527 0.3385 0.1639 0.6034 0.0619 2.8303 0.1935 0.2942 2.3082 1.5679 2.2441 5.1912 4.3949 13.4394 4.1505 3.4233 3.4966 3.7231 2.6625 2.9854 6.5519 3.1184 0.6193 1.2800 5.5132 6.5459 10.1861 7.2472 4.9890 10.5782 1.0390 11.4949 10.3639 15.7297 6.5582 0.7509 39.9036 1.2391 16.2816 41.8636 1.1671 10.5025 10.1418 0.5591 74.0176 0.6077 6.4906 18.2977 15.8984 50.3953 5.9004 23.7218 6.8837 22.7822 10.7443 1.6111 0.6861 1.0140 1.1174 14.3681 6.2278 17.9750 9.1046 50.7306 0.7219 6.1642 3.4176 15.5010 9.5514 12.2857 13.8615 19.1584 42.0386 0.7549 9.5237 26.4911 27.3813 4.6153 40.7005 42.2097 20.3666 0.5942 213.9079 6.9040 3.2101 50.0274 5.3399 25.8230 7.4527 7.0959 41.8079 25.3182 204.9631 8.2349 23.4041 135.1557 5.8120 181.9677 98.9503 1.4657 128.4850 10.2534 62.9866 87.8507 205.9519 16.2569 29.6473 7.8386 13.4737 9.8023 1.5651 10.2412 4.2519 6.6700 0.9691 9.6041 3.3581 3.2727 20.6987 6.5579
temp: 298.150 k
press: 1.00000 atm
elementType: 17 17 8 7 7 7 6 6 6 6 6 6 6 6 6 6 6 6 6 6 6 6 6 6 6 6 6 6 1 1 1 1 1 1 1 1 1 1 1 1 1 1 1
symmnumber: 1
zpe: 819482.1 jmol-1
zpe.correction: 0.312124 hartree
zpe.thermalcorrener: 0.336101 hartree
zpe.thermalcorrenthalpy: 0.337046 hartree
zpe.thermalcorrgfe: 0.253817 hartree
zpe.sumelectzpe: -2005.043897 hartree
zpe.sumelectthermal: -2005.019920 hartree
zpe.sumelectthermalent: -2005.018975 hartree
zpe.sumelectthermalfe: -2005.102204 hartree
dipole: -4.4934 2.3481 1.3165
dipole: 5.2381
quadrupole: -152.4491 -179.9893 -170.7580
quadrupole: 20.2398 -0.0665 -4.0842
quadrupole: 15.2830 -12.2572 -3.0258 20.2398 -0.0665 -4.0842
hfenergy: -2005.356021 hartree
pointgroup: C01 [X(C22H15Cl2N3O1)]
dipole: 1.7289725 -1.0307418 0.4417743 debye
polarizability: 582.9928713|-3.2532016|234.4791037|-0.2313273|16.3502813|182.316576 unknown
InChI: InChI=1S/C22H15Cl2N3O/c1-14-26-21-11-6-16(23)12-19(21)22(28)27(14)18-9-7-17(8-10-18)25-13-15-4-2-3-5-20(15)24/h2-13H,1H3
charge 0 multiplicity 1
43 atoms
Cl -7.964804 2.455435 -0.921696
Cl 6.237888 -1.758701 -2.195218
O  -2.521907 1.806379 -0.406204
N  -2.226497 -0.46877 0.125423
N  -4.076614 -2.002306 0.322203
N  3.395129 0.444437 0.460956
C  -4.488734 0.38503 -0.228043
C  -0.786539 -0.251531 0.193474
C  -2.775382 -1.752762 0.361972
C  -3.042612 0.676618 -0.191959
C  -4.953868 -0.942805 0.031767
C  -0.175288 0.019517 1.438379
C  -0.017925 -0.27321 -0.990687
C  -5.40317 1.429893 -0.520492
C  -1.823995 -2.883364 0.668119
C  -6.352682 -1.204093 -0.007216
C  2.007944 0.182418 0.323974
C  1.211616 0.246518 1.500804
C  1.372407 -0.062539 -0.929238
C  -6.768942 1.132813 -0.549021
C  -7.260953 -0.173947 -0.295812
C  5.710774 0.199606 -0.21749
C  4.281292 -0.146534 -0.303521
C  6.702103 -0.439877 -1.008602
C  6.152282 1.215405 0.681661
C  8.066076 -0.104401 -0.927456
C  7.509823 1.56571 0.779488
C  8.470864 0.905733 -0.026299
H  -0.788888 0.07569 2.343627
H  -0.513919 -0.433899 -1.953543
H  -5.016394 2.434453 -0.714262
H  -1.259742 -2.702445 1.600304
H  -1.07923 -3.018669 -0.13643
H  -2.416306 -3.802753 0.777314
H  -6.69549 -2.223236 0.192288
H  1.704498 0.47683 2.449978
H  1.960313 -0.044913 -1.853579
H  -8.336878 -0.368871 -0.32717
H  4.010321 -0.938353 -1.027516
H  5.384298 1.706178 1.288122
H  8.795986 -0.621909 -1.556033
H  7.824457 2.348706 1.476948
H  9.530694 1.172623 0.041886
