program: Gaussian 09
title: 000261089
version: EM64L-G09RevD.01
frameworkgroup: C1[X(C6H14Cl2N2O4S2)]
method: RPBEPBE
basis: SDD
operation: Freq
keyword: #p
keyword: freq=noraman
keyword: PBEPBE/SDD
title: #p freq=noraman PBEPBE/SDD
converged: YES YES NO NO
title: Mulliken charges:
elementType: Cl Cl S S O O O O N N C C C C C C H H H H H H H H H H H H H H
charge: -0.053192 -0.053344 1.035052 1.033748 -0.532717 -0.559372 -0.532817 -0.558116 -0.531111 -0.529684 -0.359962 -0.364835 -0.364888 -0.364752 -0.714779 -0.714429 0.353167 0.355133 0.280705 0.250813 0.280404 0.251658 0.345986 0.345586 0.291361 0.286909 0.272733 0.286769 0.272806 0.291165
chargesum: 0.00000
title: Mulliken charges with hydrogens summed into heavy atoms:
elementType: Cl Cl S S O O O O N N C C C C C C
charge: -0.053192 -0.053344 1.035052 1.033748 -0.532717 -0.559372 -0.532817 -0.558116 -0.185125 -0.184098 -0.006794 -0.009701 0.166630 0.167311 0.136224 0.136312
polarizability: 1.75006696e+02 2.06093262e-02 1.78527027e+02 7.95596962e+00 -6.88403819e-02 1.40038364e+02
1716.lowfreq: -2.8915 -0.0019 0.0015 0.0028 2.4370 4.1863 19.1658 22.7159 30.2938
frequency: 19.1227 22.3440 30.0606 34.1213 54.6238 81.0042 83.7287 131.4408 141.8654 148.6927 161.6607 163.0031 173.3034 195.0159 201.0567 203.2074 218.0217 251.2988 255.1466 265.0607 305.8059 316.8727 324.4793 344.9148 345.5350 386.8646 391.0994 439.6200 447.7020 469.2771 470.3709 573.4167 574.4150 634.3218 725.9731 744.4612 770.2418 805.0191 807.0466 812.5945 895.4198 897.1994 946.7477 988.7168 990.9853 1005.3386 1017.2502 1032.6146 1036.5552 1056.7775 1073.7070 1096.5939 1198.3885 1209.9862 1225.8663 1247.4469 1308.9504 1311.5277 1319.4411 1321.3550 1354.5726 1367.6972 1368.6920 1375.0592 1413.4847 1413.5427 1418.7506 1418.8590 1430.2171 1431.0734 2972.0326 2974.0654 3009.3004 3010.4104 3036.9118 3036.9465 3071.9076 3073.2474 3182.5647 3182.6576 3195.9516 3196.2780 3389.0603 3391.3875
redmass: 7.6626 5.9357 7.1193 7.2373 5.3207 5.9685 12.3707 4.8117 2.6930 2.8268 1.4521 1.5490 5.2609 3.9219 7.2277 5.1707 4.2676 3.6652 3.6724 6.1639 4.2089 6.5232 6.3364 5.0483 5.1012 4.1643 5.0997 3.0295 3.1618 3.7351 5.8096 4.3759 4.7231 4.0780 1.9187 2.1454 4.5819 12.1557 10.3843 2.4372 3.2582 3.3047 1.8207 1.3056 1.3215 3.4041 1.8527 2.2702 4.0044 4.0609 2.4938 2.6310 1.0709 1.0965 1.1770 1.1017 1.1626 1.1587 1.1569 1.1775 1.1776 1.1887 1.1762 1.3885 1.0514 1.0514 1.0520 1.0523 1.0749 1.0869 1.0874 1.0874 1.0608 1.0608 1.0249 1.0249 1.1034 1.1033 1.1071 1.1071 1.1081 1.1081 1.0757 1.0757
irintensity: 1.8963 2.3731 4.6741 8.0092 0.2960 9.0928 0.8816 0.1587 0.7322 3.4683 0.6314 2.4112 0.2654 2.2765 0.0139 3.8864 0.1448 1.4695 1.1187 0.0542 5.7371 87.8765 17.8522 23.6470 22.9629 85.8385 6.2445 99.7278 0.8555 8.6448 5.6356 0.2492 48.2389 11.1802 229.1341 98.2340 114.2977 138.3235 9.3560 29.7537 50.4516 45.2159 20.0298 28.2846 24.9854 27.0751 31.5030 23.6288 12.5893 12.7717 90.9363 5.1436 10.8216 7.4716 0.0395 7.4589 4.2123 1.8314 1.6927 0.0637 38.4523 16.5140 2.5207 1.6048 9.8449 9.8861 18.1533 6.9536 13.6125 34.5017 110.5972 82.7896 9.9664 2.7465 0.3123 0.3449 0.5714 0.5360 0.3105 0.3153 0.0826 0.0843 21.0693 26.1760
temp: 298.150 k
press: 1.00000 atm
elementType: 17 17 16 16 8 8 8 8 7 7 6 6 6 6 6 6 1 1 1 1 1 1 1 1 1 1 1 1 1 1
symmnumber: 1
zpe: 558771.8 jmol-1
zpe.correction: 0.212825 hartree
zpe.thermalcorrener: 0.234279 hartree
zpe.thermalcorrenthalpy: 0.235224 hartree
zpe.thermalcorrgfe: 0.159545 hartree
zpe.sumelectzpe: -2362.017691 hartree
zpe.sumelectthermal: -2361.996237 hartree
zpe.sumelectthermalent: -2361.995292 hartree
zpe.sumelectthermalfe: -2362.070972 hartree
dipole: 0.0008 3.0146 -0.0688
dipole: 3.0154
quadrupole: -86.3226 -155.4520 -131.8065
quadrupole: -0.3473 -3.2632 0.0283
quadrupole: 38.2044 -30.9250 -7.2795 -0.3473 -3.2632 0.0283
hfenergy: -2362.2305161 hartree
pointgroup: C01 [X(C6H14Cl2N2O4S2)]
dipole: -0.0869658 -1.0956021 -0.4466868 debye
polarizability: 176.6778231|0.705995|173.2838748|-1.4257419|13.5135311|143.6103901 unknown
InChI: InChI=1S/C6H14Cl2N2O4S2/c1-15(11,12)9-3-5(7)6(8)4-10-16(2,13)14/h5-6,9-10H,3-4H2,1-2H3
charge 0 multiplicity 1
30 atoms
Cl -1.015523 -2.879604 0.455873
Cl 0.754874 -2.006404 -2.255347
S  2.900815 0.946693 0.832335
S  -2.533933 1.631444 0.211444
O  2.876375 2.194009 1.870153
O  2.399765 1.133608 -0.714219
O  -2.245847 3.226864 0.28551
O  -2.12879 0.647293 1.454472
N  1.997183 -0.410926 1.724231
N  -1.778616 1.099793 -1.403406
C  -0.001955 -1.261203 0.364145
C  -0.009204 -0.720828 -1.063987
C  1.394087 -1.53876 0.97586
C  -1.393934 -0.313969 -1.626781
C  4.647534 0.207836 0.760199
C  -4.371893 1.330036 -0.153069
H  -0.593014 -0.576633 1.005672
H  0.711704 0.118885 -1.129756
H  1.302336 -2.360918 1.709399
H  2.09144 -1.883941 0.191212
H  -1.382432 -0.44578 -2.724372
H  -2.177848 -0.983373 -1.228937
H  1.360456 0.076356 2.381525
H  -1.034007 1.796196 -1.592777
H  5.27028 0.979421 0.286474
H  4.931547 0.007549 1.800916
H  4.585907 -0.704318 0.151731
H  -4.604312 1.932211 -1.040351
H  -4.492758 0.252276 -0.325895
H  -4.906038 1.667188 0.746148
