program: Gaussian 09
title: 000261102
version: EM64L-G09RevD.01
frameworkgroup: C1[X(C24H21ClN4O)]
method: RPBEPBE
basis: SDD
operation: Freq
keyword: #p
keyword: freq=noraman
keyword: PBEPBE/SDD
title: #p freq=noraman PBEPBE/SDD
converged: YES YES NO NO
title: Mulliken charges:
elementType: Cl O N N N N C C C C C C C C C C C C C C C C C C C C C C C C H H H H H H H H H H H H H H H H H H H H H
charge: -0.052294 -0.227883 -0.350117 -0.042299 -0.148928 -0.087236 0.178425 0.463297 0.107719 0.119674 0.039701 -0.336565 -0.334908 -0.288793 -0.767122 -0.336570 0.252170 -0.373347 -0.350848 -0.130549 -0.188537 0.410725 0.465967 -0.360620 -0.336149 -0.395965 -0.402390 -0.400696 -0.645632 -0.646058 0.248908 0.246139 0.294763 0.253020 0.250292 0.264564 0.265101 0.254484 0.245131 0.259328 0.238822 0.239594 0.222901 0.271760 0.215162 0.220094 0.238407 0.238314 0.239458 0.240231 0.219355
chargesum: 0.00000
title: Mulliken charges with hydrogens summed into heavy atoms:
elementType: Cl O N N N N C C C C C C C C C C C C C C C C C C C C C C C C
charge: -0.052294 -0.227883 -0.350117 -0.042299 -0.148928 -0.087236 0.178425 0.463297 0.107719 0.119674 0.039701 -0.087657 -0.088768 0.005970 0.000754 -0.071469 0.252170 -0.118863 -0.105718 -0.130549 0.070791 0.410725 0.465967 -0.121798 -0.096555 -0.173064 -0.130630 -0.185534 0.051183 0.052987
polarizability: 7.35331023e+02 8.08848269e+00 2.45584421e+02 7.95505033e+00 -1.31984554e+01 1.94379632e+02
1716.lowfreq: -2.8732 -1.4066 -0.0017 -0.0011 -0.0003 1.6258 11.5725 14.7795 19.2618
frequency: 11.0888 14.5127 19.2463 36.8322 41.2685 52.1644 68.2019 74.6821 88.2796 101.0867 118.5938 135.5181 152.1526 155.1034 157.5711 171.4884 184.7729 195.4735 198.3758 229.4210 252.5531 259.6661 290.6959 303.2000 335.3779 357.1337 358.9062 369.5711 397.0174 409.4339 414.4122 415.7070 428.9610 446.9765 466.4317 492.2181 505.7995 514.3053 525.3657 540.5359 545.7653 557.9501 566.0533 620.9564 626.9723 632.0765 642.6443 665.2944 676.6012 696.0059 721.8039 733.4738 743.3907 787.2424 806.7963 814.0519 820.5597 830.0988 835.9166 840.3774 844.5841 860.3565 880.8053 924.0253 940.1732 941.5842 946.7521 968.2958 970.7081 977.4493 988.2624 989.9148 994.5226 1001.1691 1020.5097 1046.6410 1056.2839 1061.5904 1081.1735 1105.2441 1106.5063 1111.0848 1116.5933 1127.8416 1161.8470 1166.1152 1182.5868 1196.5785 1201.4835 1225.7870 1241.4658 1256.6068 1264.8999 1272.3401 1290.5324 1309.6842 1317.4339 1348.5161 1363.1129 1370.7595 1387.1852 1394.3704 1395.3571 1412.5507 1415.1171 1430.3539 1448.4379 1450.5984 1452.9453 1458.9747 1460.7342 1464.6803 1477.2180 1488.5889 1491.9840 1505.9117 1533.4180 1549.0161 1552.6026 1560.0550 1566.6529 1585.5034 1605.9777 1618.1106 1621.4303 1634.7706 2931.1770 2947.1900 2954.7486 2998.2108 3015.4022 3019.8338 3077.1238 3100.5068 3110.5879 3115.2116 3133.6136 3135.3800 3141.5397 3147.4034 3155.0630 3159.3251 3166.3083 3168.9808 3171.1399 3171.3590 3179.3797
redmass: 5.0467 4.9922 6.2095 5.4485 3.8274 5.7547 5.0197 2.3396 5.4478 6.1395 1.6805 3.9402 3.3857 1.5064 3.7507 4.6530 3.1225 1.5865 2.1232 4.4843 3.0325 3.8306 4.9631 4.4578 7.3536 3.7437 5.4401 4.8877 5.4186 5.0918 4.1856 2.9709 3.1207 4.0116 3.7993 3.9162 5.0068 6.0857 2.7329 3.0220 4.0539 5.7694 4.8846 4.8646 4.5783 6.5646 6.1295 6.5771 6.8812 6.1019 4.8214 3.9181 3.5508 3.8330 1.3343 3.3514 2.0151 1.5501 1.7014 1.6209 4.4634 4.6279 4.2400 1.4328 2.6005 1.4708 1.4128 1.3629 1.3476 1.5034 2.0986 2.0331 2.9059 2.7499 2.4990 1.5521 1.5085 2.1052 3.5794 1.2372 1.3080 1.3277 1.6166 1.4932 1.6888 1.5466 1.3863 2.5585 1.5933 1.9513 4.1670 2.9003 1.7407 2.1354 1.2906 4.5823 1.6435 3.2947 2.5843 4.3087 9.6635 1.4636 2.1386 4.0084 3.9784 1.2414 1.3132 2.7053 2.1190 1.2774 1.0537 1.0401 1.0456 2.4808 1.1261 1.1539 2.8272 7.0031 8.1261 6.9852 7.4453 5.9424 7.9632 8.9198 7.4744 6.4122 1.0857 1.0368 1.0390 1.0381 1.1002 1.1024 1.0968 1.0966 1.0946 1.0894 1.0875 1.0992 1.0893 1.0876 1.0970 1.0885 1.0931 1.0966 1.0953 1.0930 1.0978
irintensity: 0.5970 0.4204 0.9863 0.2206 0.1452 0.5114 0.6331 0.1798 1.6622 1.1163 3.5977 0.7717 0.0961 2.4110 0.7242 1.8748 1.6095 1.2991 2.6349 7.1229 2.3621 1.9509 3.6355 4.3125 3.9692 12.4364 2.1388 2.1991 0.5572 4.0919 1.1349 1.0234 1.6640 1.8328 3.2304 10.9125 0.7777 18.3533 6.1170 20.0603 15.3955 13.2412 9.3521 1.0013 38.3902 8.6207 0.7175 5.7751 30.1380 1.6571 15.4863 4.8937 3.4087 0.5486 13.3613 3.5173 9.3535 36.6359 41.5773 49.8874 7.9002 30.8340 30.8690 10.9827 41.1572 1.8056 0.8943 0.8356 1.1085 22.7606 3.4145 15.0296 0.1064 21.7068 0.9611 3.5271 25.7811 15.9531 7.8066 0.0216 13.8867 0.9859 18.3387 26.8621 197.7904 25.3413 160.2336 32.9060 15.2499 25.9975 38.6087 26.1607 10.4746 31.5617 0.5631 171.6361 55.4674 0.2924 131.8682 246.1951 50.9214 25.1522 5.5732 14.9830 4.1300 16.4636 35.1109 70.4571 208.5183 12.1207 25.4624 0.0889 23.4110 203.3939 21.8060 33.6812 531.8050 202.7736 5.5555 218.3784 5.5936 851.9890 76.7830 98.1711 202.7332 274.9485 51.7117 99.8689 171.4048 15.1222 17.0678 61.7263 7.7500 4.1603 50.9468 9.9122 16.1164 15.9003 15.0721 2.5698 9.3372 1.0396 22.8827 4.0785 20.4244 2.9082 7.9983
temp: 298.150 k
press: 1.00000 atm
elementType: 17 8 7 7 7 7 6 6 6 6 6 6 6 6 6 6 6 6 6 6 6 6 6 6 6 6 6 6 6 6 1 1 1 1 1 1 1 1 1 1 1 1 1 1 1 1 1 1 1 1 1
symmnumber: 1
zpe: 1032664.3 jmol-1
zpe.correction: 0.393321 hartree
zpe.thermalcorrener: 0.420486 hartree
zpe.thermalcorrenthalpy: 0.421431 hartree
zpe.thermalcorrgfe: 0.331953 hartree
zpe.sumelectzpe: -1679.364880 hartree
zpe.sumelectthermal: -1679.337715 hartree
zpe.sumelectthermalent: -1679.336770 hartree
zpe.sumelectthermalfe: -1679.426248 hartree
dipole: -9.7813 3.2325 -0.7479
dipole: 10.3287
quadrupole: -107.0166 -187.0213 -173.9998
quadrupole: 19.2623 5.9397 -5.4539
quadrupole: 48.9960 -31.0087 -17.9873 19.2623 5.9397 -5.4539
hfenergy: -1679.7582011 hartree
pointgroup: C01 [X(C24H21Cl1N4O1)]
dipole: 3.8056064 -1.4220104 0.091191 debye
polarizability: 735.3528176|-8.6748565|248.8266021|6.101524|1.4269391|191.1156569 unknown
InChI: InChI=1S/C24H21ClN4O/c1-16-27-23-13-6-18(25)14-22(23)24(30)29(16)21-11-7-19(8-12-21)26-15-17-4-9-20(10-5-17)28(2)3/h4-15H,1-3H3
charge 0 multiplicity 1
51 atoms
Cl -8.660276 2.652963 -1.264764
O  -3.271793 1.753038 -0.603226
N  -3.105913 -0.487108 0.109121
N  -5.041243 -1.901949 0.381327
N  9.073918 0.397926 -0.056119
N  2.55356 0.141522 0.515254
C  -5.313379 0.455247 -0.353299
C  -1.656764 -0.344177 0.196257
C  -3.72826 -1.717276 0.427241
C  -3.853543 0.671503 -0.310418
C  -5.854533 -0.821957 -0.002853
C  -1.056111 -0.019245 1.434052
C  -0.864502 -0.492765 -0.962426
C  -6.164342 1.522487 -0.740844
C  -2.844288 -2.872183 0.831124
C  -7.265397 -1.008645 -0.047467
C  1.161371 -0.056264 0.368395
C  0.339561 0.131998 1.51659
C  0.534206 -0.353727 -0.879983
C  -7.54391 1.299056 -0.771408
C  -8.111215 0.044208 -0.428914
C  7.700555 0.162405 -0.079149
C  4.861381 -0.313605 -0.127517
C  7.14355 -0.912581 -0.848578
C  6.792579 0.990418 0.668071
C  5.759254 -1.135992 -0.864958
C  5.414643 0.753731 0.639787
C  3.424612 -0.566475 -0.173335
C  9.98322 -0.462184 -0.826798
C  9.62224 1.509852 0.734903
H  -1.684616 0.134802 2.317912
H  -1.347333 -0.694171 -1.924741
H  -5.719037 2.486521 -1.002915
H  -2.28841 -2.655084 1.760515
H  -2.09156 -3.097115 0.054766
H  -3.486419 -3.750176 0.988753
H  -7.667096 -1.989484 0.222267
H  0.823782 0.399708 2.460527
H  1.14215 -0.430856 -1.788293
H  -9.195788 -0.093833 -0.464387
H  7.794279 -1.569229 -1.432039
H  7.174657 1.819334 1.270173
H  5.359044 -1.965249 -1.463017
H  4.726471 1.387331 1.209196
H  3.105688 -1.418745 -0.813468
H  11.019771 -0.119109 -0.685565
H  9.757737 -0.428808 -1.911752
H  9.926009 -1.51906 -0.497174
H  9.396321 1.396887 1.814022
H  9.221252 2.487687 0.400977
H  10.716814 1.536031 0.618974
