program: Gaussian 09
title: 000261073
version: EM64L-G09RevD.01
frameworkgroup: C1[X(C6H14Br2N2O4S2)]
method: RPBEPBE
basis: SDD
operation: Freq
keyword: #p
keyword: freq=noraman
keyword: PBEPBE/SDD
title: #p freq=noraman PBEPBE/SDD
converged: YES YES NO NO
title: Mulliken charges:
elementType: Br Br S S O O O O N N C C C C C C H H H H H H H H H H H H H H
charge: 0.027526 0.027779 1.044042 1.044200 -0.578813 -0.527961 -0.578805 -0.527815 -0.546286 -0.546338 -0.057204 -0.058717 -0.724483 -0.724155 -0.747801 -0.747965 0.321188 0.320949 0.319010 0.319323 0.273545 0.279647 0.279485 0.273827 0.289036 0.336193 0.292630 0.292722 0.289012 0.336228
chargesum: 0.00000
title: Mulliken charges with hydrogens summed into heavy atoms:
elementType: Br Br S S O O O O N N C C C C C C
charge: 0.027526 0.027779 1.044042 1.044200 -0.578813 -0.527961 -0.578805 -0.527815 -0.227276 -0.227015 0.263984 0.262233 -0.171290 -0.170844 0.170058 0.169997
polarizability: 2.10988628e+02 7.68572203e-03 1.57683630e+02 -2.77973297e+00 -5.67075843e-02 1.58672005e+02
1716.lowfreq: -10.8075 -9.2449 -6.5451 -0.0005 0.0007 0.0011 30.4630 31.4579 45.8197
frequency: 30.3982 31.4377 45.8117 49.0162 76.0909 79.7776 89.0174 106.7681 117.8872 139.2908 150.6479 152.7512 167.0972 183.6552 207.6665 217.5914 234.4573 252.8048 257.1295 264.2694 273.3447 276.9853 328.9152 341.4692 343.8533 391.3402 396.3532 415.2757 452.8905 481.1041 504.6758 559.3214 563.1266 621.4371 686.1397 740.1960 746.8979 796.9906 806.4556 830.7739 841.5640 888.0490 905.4855 906.6317 1001.1322 1002.9633 1009.5005 1011.1893 1043.7248 1052.2521 1071.0154 1080.2000 1166.7627 1173.4809 1217.6528 1227.0372 1266.6483 1285.1683 1297.3704 1323.9210 1324.7622 1347.8888 1404.3314 1410.7909 1412.2480 1421.4875 1437.0847 1440.8769 1441.1562 1446.9179 3002.9180 3003.8179 3009.1934 3011.0673 3033.9967 3041.2071 3117.6521 3121.6970 3152.8767 3153.5963 3189.0480 3189.2191 3408.0448 3409.5582
redmass: 9.7862 11.2089 8.0173 12.5651 6.2274 8.9413 4.7490 5.2016 4.0262 12.8448 7.1346 3.3373 3.0307 3.8454 1.2003 1.3158 3.7468 4.5437 3.3485 6.1302 7.4450 3.5870 4.9137 6.2283 5.1665 5.6077 3.9560 2.0763 3.6155 3.4135 3.6281 5.3680 5.7816 6.0142 3.4631 2.5753 2.4931 12.4324 10.4366 2.0258 1.8270 3.3477 4.6274 4.0263 1.3163 1.2794 2.0687 1.8346 1.5374 1.5649 3.2090 3.2941 1.5168 1.4430 1.1734 1.1911 1.1148 1.1818 1.2134 1.1341 1.1331 1.3577 1.1049 1.0511 1.0474 1.1727 1.1015 1.0945 1.0610 1.0690 1.0782 1.0750 1.0361 1.0358 1.0567 1.0572 1.1095 1.1097 1.1060 1.1061 1.1079 1.1079 1.0759 1.0758
irintensity: 0.7161 0.4695 0.5114 1.3897 3.8372 16.8624 0.0718 5.3990 6.2225 0.0851 14.4583 0.7841 3.1223 0.6581 3.5988 3.4390 3.2179 1.3185 0.0049 8.6211 1.3946 15.4744 5.3645 19.0599 54.5071 106.3043 22.5545 6.8658 14.7632 135.3139 1.2938 8.0095 24.1398 3.6473 125.5807 72.5320 81.4151 9.6175 134.0735 7.0004 7.1741 0.3717 120.7259 5.5903 8.4990 32.7494 21.0200 27.9865 189.5509 1.6718 2.6305 3.3734 35.7720 28.3373 1.8680 44.0391 11.5907 34.7094 0.3370 9.8645 12.1342 19.0913 5.7135 4.8112 3.0516 4.4008 0.7894 11.4907 3.1428 36.1685 10.4170 9.7613 1.9844 52.9917 31.1449 9.5249 0.5467 9.3597 0.2588 35.2469 2.4613 0.2435 15.7315 16.5872
temp: 298.150 k
press: 1.00000 atm
elementType: 35 35 16 16 8 8 8 8 7 7 6 6 6 6 6 6 1 1 1 1 1 1 1 1 1 1 1 1 1 1
symmnumber: 1
zpe: 556947.2 jmol-1
zpe.correction: 0.212130 hartree
zpe.thermalcorrener: 0.233691 hartree
zpe.thermalcorrenthalpy: 0.234635 hartree
zpe.thermalcorrgfe: 0.159216 hartree
zpe.sumelectzpe: -1468.816513 hartree
zpe.sumelectthermal: -1468.794952 hartree
zpe.sumelectthermalent: -1468.794008 hartree
zpe.sumelectthermalfe: -1468.869427 hartree
dipole: -0.0014 -1.6803 -0.0420
dipole: 1.6808
quadrupole: -138.1965 -121.0429 -162.6046
quadrupole: -0.0066 1.3764 0.7197
quadrupole: 2.4182 19.5718 -21.9899 -0.0066 1.3764 0.7197
hfenergy: -1469.0286429 hartree
pointgroup: C01 [X(C6H14Br2N2O4S2)]
dipole: -0.0002444 0.6610251 -0.0179931 debye
polarizability: 191.6022662|-0.6700794|157.6979667|-25.4092903|0.5822275|178.0440301 unknown
InChI: InChI=1S/C6H14Br2N2O4S2/c1-15(11,12)9-5(3-7)6(4-8)10-16(2,13)14/h5-6,9-10H,3-4H2,1-2H3
charge 0 multiplicity 1
30 atoms
Br -1.989478 2.216546 2.816835
Br 2.019063 2.077213 -2.904203
S  -2.142645 -1.036961 -0.788996
S  2.124772 -1.023012 0.823472
O  -0.792622 -1.616939 -1.52034
O  -3.5270 -0.976262 -1.627228
O  0.768645 -1.557763 1.577872
O  3.510129 -0.943069 1.65834
N  -1.913017 0.697627 -0.177426
N  1.911774 0.686897 0.141612
C  -0.627795 1.02965 0.469919
C  0.630445 1.00264 -0.52072
C  -0.760427 2.361425 1.219913
C  0.776823 2.299837 -1.326895
C  -2.343829 -1.964616 0.854814
C  2.315381 -2.018872 -0.781837
H  -0.42351 0.232498 1.20928
H  0.419029 0.176385 -1.225236
H  -2.241982 1.32263 -0.933708
H  2.246617 1.339833 0.871147
H  0.208616 2.675426 1.641451
H  -1.1877 3.169916 0.605872
H  1.203528 3.131809 -0.744517
H  -0.186535 2.60095 -1.770341
H  -2.681052 -2.970985 0.568469
H  -1.345724 -1.973411 1.320789
H  -3.097534 -1.406408 1.424742
H  3.07437 -1.491859 -1.374064
H  2.642529 -3.016243 -0.455204
H  1.317031 -2.036085 -1.247014
