program: Gaussian 09
title: 000261071
version: EM64L-G09RevD.01
frameworkgroup: C1[X(C21H14N2O2)]
method: RPBEPBE
basis: SDD
operation: Freq
keyword: #p
keyword: freq=noraman
keyword: PBEPBE/SDD
title: #p freq=noraman PBEPBE/SDD
converged: YES YES NO NO
title: Mulliken charges:
elementType: O O N N C C C C C C C C C C C C C C C C C C C C C H H H H H H H H H H H H H H
charge: -0.216122 -0.192539 -0.226309 -0.357269 0.152173 0.198659 0.096747 0.156216 0.213906 0.168980 0.068063 -0.360965 -0.408600 0.029259 -0.357338 -0.653167 -0.373703 0.486713 -0.269322 -0.217359 -0.350398 -0.351619 -0.224949 -0.224840 -0.244594 0.249041 0.268402 0.300871 0.243773 0.242252 0.243958 0.230501 0.230777 0.226131 0.270166 0.269219 0.227474 0.227080 0.228729
chargesum: 0.00000
title: Mulliken charges with hydrogens summed into heavy atoms:
elementType: O O N N C C C C C C C C C C C C C C C C C C C C C
charge: -0.216122 -0.192539 -0.226309 -0.357269 0.152173 0.198659 0.096747 0.156216 0.213906 0.168980 0.068063 -0.111924 -0.140198 0.029259 -0.056466 0.076816 -0.143202 0.486713 -0.038545 0.008772 -0.080232 -0.082400 0.002526 0.002240 -0.015865
polarizability: 4.23962747e+02 2.15191691e+01 2.92936976e+02 3.84268052e+00 7.89972405e+00 1.08046644e+02
1716.lowfreq: -69.2108 -5.2695 -4.4598 -0.0005 -0.0003 0.0001 3.1805 34.7309 41.0107
frequency: -69.1902 34.7285 41.0046 68.6960 69.9540 92.5636 130.8567 138.8489 147.5023 173.3599 213.1792 230.8672 249.5791 277.7669 285.1331 298.7938 321.0573 348.3464 378.2776 404.2300 414.2071 438.0631 484.0914 489.0180 513.6586 547.7629 559.2044 561.2767 577.6979 609.2853 612.0569 616.2105 654.3393 671.8998 691.0713 709.4356 726.3037 732.3223 757.9045 764.6605 766.2092 784.5881 797.3224 826.0456 834.7631 836.0606 867.0208 887.0781 911.2675 947.6231 958.6446 962.2583 968.7011 989.7343 990.4035 1001.0240 1018.5277 1022.2426 1027.1661 1046.1940 1087.3928 1099.1467 1115.0781 1119.5833 1128.8217 1143.8139 1166.6940 1174.5661 1179.6506 1195.5298 1235.9403 1248.2635 1303.8150 1326.8522 1328.6682 1331.1780 1350.5626 1383.4893 1399.7467 1416.2111 1433.6032 1443.6503 1453.0410 1459.1645 1469.2233 1471.9697 1488.0736 1493.8543 1507.2092 1582.3898 1591.5228 1599.5292 1611.0356 1614.9670 1617.2018 1644.1056 1666.2124 2981.0687 3056.8063 3121.9687 3130.6719 3131.1768 3143.4537 3146.0439 3149.9422 3159.0551 3161.6414 3170.3982 3172.4703 3186.9245 3190.8271
redmass: 1.0232 5.4530 3.8899 6.3303 6.7857 4.9170 3.3396 6.3987 5.3049 7.4141 5.5469 4.4058 5.9628 5.3024 5.1734 4.8276 8.9460 6.3921 6.0990 2.8418 6.3428 3.2520 6.4007 4.9970 3.5561 5.4631 9.0493 5.1885 4.0515 8.9280 5.9359 5.4306 6.8196 6.4926 1.9737 3.8041 4.3370 8.1027 2.1492 2.2013 2.1226 5.9967 6.6364 4.5396 1.5684 1.2607 1.4189 6.8021 1.4524 5.4543 1.3595 1.3505 1.3931 5.1823 1.3787 1.3113 2.4763 4.7425 2.5861 3.9241 2.8215 1.7675 2.3062 1.3071 1.5706 1.8497 1.4705 1.0487 1.3935 1.1275 2.6762 2.4040 3.6548 2.0860 1.3255 5.4853 3.0730 8.8958 4.1609 3.5652 2.2190 2.3395 2.1039 2.8437 2.6833 1.0406 2.3125 1.2398 5.0741 6.9271 6.4921 8.0753 6.3646 9.0043 8.8501 9.2369 12.5923 1.0369 1.1021 1.0966 1.0853 1.0858 1.0907 1.0907 1.0882 1.0953 1.0972 1.0969 1.0996 1.0944 1.0966
irintensity: 0.0420 2.5792 0.5249 0.6596 0.4465 0.1081 1.4822 2.1693 3.9635 2.6629 0.5521 0.5486 0.5507 1.1761 3.6581 0.2348 6.3242 0.2656 0.8070 0.6550 6.0086 4.9902 0.5086 0.7226 11.9422 10.7699 6.0781 3.7900 0.2159 43.7831 1.8382 6.6831 0.6671 8.1538 31.9004 21.2273 18.1478 9.4215 18.4471 23.9004 107.3134 18.0727 1.8711 21.6450 36.3428 0.8458 0.1056 9.7428 5.9775 5.4557 2.4378 0.1230 0.1210 0.2971 1.2642 1.0193 46.5735 21.5614 4.7959 1.6012 24.1352 31.5598 19.8197 0.5622 0.5466 5.5952 43.8128 0.1569 10.1325 1.7955 63.8154 86.2299 21.5380 127.4143 1.1735 471.2810 125.7692 0.1393 8.7860 7.9292 15.4817 20.5923 8.4688 39.8646 32.8281 14.6623 203.5321 38.3608 112.0940 2.3440 26.8888 13.8286 11.4313 71.9391 304.7782 44.2148 151.7783 73.7143 23.3863 7.5117 0.0734 1.7091 19.5862 19.2725 4.4937 11.2980 44.1790 8.7499 31.6542 3.5063 1.3183
temp: 298.150 k
press: 1.00000 atm
elementType: 8 8 7 7 6 6 6 6 6 6 6 6 6 6 6 6 6 6 6 6 6 6 6 6 6 1 1 1 1 1 1 1 1 1 1 1 1 1 1
symmnumber: 1
zpe: 773160.2 jmol-1
zpe.correction: 0.294481 hartree
zpe.thermalcorrener: 0.312955 hartree
zpe.thermalcorrenthalpy: 0.313899 hartree
zpe.thermalcorrgfe: 0.247529 hartree
zpe.sumelectzpe: -1066.966910 hartree
zpe.sumelectthermal: -1066.948437 hartree
zpe.sumelectthermalent: -1066.947493 hartree
zpe.sumelectthermalfe: -1067.013862 hartree
dipole: -5.7847 1.2417 0.0047
dipole: 5.9164
quadrupole: -109.4412 -136.8160 -147.3651
quadrupole: -15.8830 2.3114 4.0833
quadrupole: 21.7663 -5.6086 -16.1577 -15.8830 2.3114 4.0833
hfenergy: -1067.2613915 hartree
pointgroup: C01 [X(C21H14N2O2)]
dipole: 2.2643448 -0.5393934 0.0025973 debye
polarizability: 424.8451942|18.5067291|291.8826762|-4.7624342|-9.5003816|108.218496 unknown
InChI: InChI=1S/C21H14N2O2/c1-22-16-10-6-5-9-14(16)18-17(22)12-11-15-19(18)21(25)23(20(15)24)13-7-3-2-4-8-13/h2-12H,1H3
charge 0 multiplicity 1
39 atoms
O  -0.861392 1.77419 0.045802
O  -2.653144 -2.60783 -0.111221
N  3.77022 -1.08496 -0.02914
N  -2.123869 -0.26284 -0.023266
C  1.602985 -0.268094 -0.008704
C  2.424429 -1.464784 -0.04796
C  0.210754 -0.459934 -0.022639
C  2.511195 0.866089 0.036797
C  3.845804 0.326902 0.02288
C  -0.329381 -1.768221 -0.069277
C  -0.916324 0.51776 0.003899
C  1.883504 -2.771331 -0.096849
C  0.478399 -2.923121 -0.107105
C  -1.811832 -1.677168 -0.070424
C  2.317626 2.267999 0.089382
C  4.896126 -2.018296 -0.057318
C  4.981377 1.161773 0.058878
C  -3.454971 0.281613 -0.006374
C  3.451381 3.10485 0.12549
C  4.764304 2.556553 0.109983
C  -4.487273 -0.398342 0.688259
C  -3.733586 1.496156 -0.682646
C  -5.792627 0.136615 0.696276
C  -5.040721 2.02618 -0.654948
C  -6.07653 1.350439 0.029682
H  2.535905 -3.649405 -0.125572
H  0.014836 -3.913538 -0.143662
H  1.300588 2.671099 0.10198
H  4.87533 -2.635871 -0.97432
H  5.841257 -1.455723 -0.042923
H  4.87824 -2.687767 0.822665
H  6.000049 0.761129 0.04905
H  3.323218 4.191381 0.166631
H  5.628468 3.229737 0.13897
H  -4.274116 -1.338693 1.20103
H  -2.936011 2.024348 -1.209498
H  -6.586983 -0.396374 1.230058
H  -5.248485 2.967624 -1.175063
H  -7.09075 1.763956 0.043498
