program: Gaussian 09
title: 000261067
version: EM64L-G09RevD.01
frameworkgroup: C1[X(C20H12N2O2)]
method: RPBEPBE
basis: SDD
operation: Freq
keyword: #p
keyword: freq=noraman
keyword: PBEPBE/SDD
title: #p freq=noraman PBEPBE/SDD
converged: YES YES NO NO
title: Mulliken charges:
elementType: O O N N C C C C C C C C C C C C C C C C C C C C H H H H H H H H H H H H
charge: -0.224483 -0.184231 -0.455748 -0.360909 0.103316 0.086640 0.214289 0.220720 0.187980 0.217302 0.071861 -0.414387 0.039774 -0.413103 -0.383304 0.485495 -0.365956 -0.248611 -0.207677 -0.351180 -0.350670 -0.224088 -0.225243 -0.244072 0.346297 0.244999 0.266922 0.238292 0.243099 0.229207 0.229541 0.272179 0.269950 0.228431 0.227676 0.229693
chargesum: 0.00000
title: Mulliken charges with hydrogens summed into heavy atoms:
elementType: O O N N C C C C C C C C C C C C C C C C C C C C
charge: -0.224483 -0.184231 -0.109451 -0.360909 0.103316 0.086640 0.214289 0.220720 0.187980 0.217302 0.071861 -0.169389 0.039774 -0.146180 -0.145012 0.485495 -0.122857 -0.019404 0.021864 -0.079000 -0.080720 0.004344 0.002433 -0.014379
polarizability: 4.59715113e+02 -1.49939367e+01 2.46858046e+02 -2.94067816e+00 6.23019935e+00 9.79608399e+01
1716.lowfreq: -7.3122 -2.7037 -0.0006 -0.0002 0.0003 2.2775 31.1474 41.1627 66.3858
frequency: 31.1122 41.1584 66.3813 73.2486 97.2552 132.9648 153.0940 175.6208 199.7650 221.8224 274.2684 279.8260 305.5146 312.0637 321.0254 373.6201 400.1527 403.7151 436.9202 474.1048 503.4967 513.2971 531.2901 570.8892 572.5360 581.7107 594.7965 611.7941 613.3155 615.6604 669.7606 691.1902 714.7373 720.4256 729.1222 739.3711 757.4786 760.4035 769.8825 792.6900 809.9314 836.5754 845.2376 853.3966 865.9873 911.0986 920.8173 944.1356 969.6605 970.2019 971.9951 981.3554 989.7075 991.3305 1014.9226 1015.7393 1029.3462 1050.4084 1097.2193 1113.7517 1126.2586 1163.7096 1172.7050 1175.0955 1196.5720 1221.8551 1237.6716 1242.3908 1296.9361 1314.4333 1329.4737 1330.1040 1347.9166 1382.9507 1396.5656 1418.8086 1443.8663 1450.1819 1465.2856 1469.6304 1488.1931 1497.4163 1588.8213 1591.3801 1605.0964 1611.7383 1616.3182 1630.7480 1663.3913 1673.7686 3131.1396 3132.9830 3140.7124 3143.6032 3145.7482 3153.9354 3162.2062 3169.8357 3172.1798 3188.4834 3192.1288 3587.2577
redmass: 5.5769 4.1419 5.7203 7.5241 6.2525 6.8151 4.9693 7.5465 5.5422 6.5195 5.5608 7.5859 8.4830 5.5594 5.3508 6.1270 8.0391 2.8440 3.3130 4.3532 4.7693 3.5807 8.4334 4.5872 3.9594 7.0432 8.3182 7.3686 3.7246 1.3356 6.9406 1.9703 4.9145 6.1328 4.6575 5.4104 1.4349 3.5790 2.2347 5.6178 6.2704 1.2578 5.8380 1.4395 1.6191 1.5815 4.9179 1.3976 1.4087 4.3817 1.3797 1.3200 5.6832 1.3537 4.3880 2.4597 2.5199 3.5369 1.6333 1.9317 2.0963 1.4972 1.2570 1.0501 1.1256 2.1110 1.8700 2.5895 3.0463 2.5795 2.0482 1.9019 2.9793 8.7220 3.7433 4.0029 2.3451 2.8905 3.9163 4.3723 2.4051 4.5383 6.6082 6.3615 8.3219 6.0255 11.3607 7.2528 11.5789 10.5196 1.0854 1.0854 1.0897 1.0908 1.0892 1.0954 1.0974 1.1003 1.0960 1.0943 1.0964 1.0811
irintensity: 0.7371 0.4436 0.3600 0.4043 0.6601 2.8023 3.2856 2.5179 0.6860 0.6230 0.4872 3.5694 7.7758 4.3981 0.3850 0.8869 2.2386 0.6844 7.9457 1.4023 14.1899 8.6073 0.5846 0.4562 3.1629 3.4285 8.8468 39.7880 21.4121 86.8450 3.1509 34.7689 4.4392 1.3377 8.4340 32.3689 102.5009 15.6935 50.1412 13.7724 25.9408 0.0671 5.6345 16.8646 8.0535 3.7392 6.6769 2.4241 0.6911 18.6681 0.0266 0.0743 0.5132 1.4557 53.6383 8.5526 7.6985 3.3118 25.3602 1.4757 79.7241 39.7140 24.9694 0.1906 2.2856 58.5045 13.6546 135.3423 32.2276 3.3358 345.4652 281.7514 62.3725 0.1837 16.8968 28.7170 20.8645 8.4106 7.0825 84.1876 188.0436 52.0034 3.4631 22.2584 9.9330 34.0307 371.6321 53.6723 82.4359 131.5652 0.1226 0.1629 3.1138 19.6093 3.6933 22.2169 43.9699 34.6164 6.8346 2.9366 1.3748 64.8057
temp: 298.150 k
press: 1.00000 atm
elementType: 8 8 7 7 6 6 6 6 6 6 6 6 6 6 6 6 6 6 6 6 6 6 6 6 1 1 1 1 1 1 1 1 1 1 1 1
symmnumber: 1
zpe: 702685.2 jmol-1
zpe.correction: 0.267639 hartree
zpe.thermalcorrener: 0.285070 hartree
zpe.thermalcorrenthalpy: 0.286014 hartree
zpe.thermalcorrgfe: 0.221757 hartree
zpe.sumelectzpe: -1027.750075 hartree
zpe.sumelectthermal: -1027.732644 hartree
zpe.sumelectthermalent: -1027.731700 hartree
zpe.sumelectthermalfe: -1027.795957 hartree
dipole: 3.6715 -1.0572 0.1182
dipole: 3.8225
quadrupole: -113.7420 -130.2546 -141.7915
quadrupole: 4.9029 -1.7293 3.7265
quadrupole: 14.8540 -1.6585 -13.1955 4.9029 -1.7293 3.7265
hfenergy: -1028.0177138 hartree
pointgroup: C01 [X(C20H12N2O2)]
dipole: -1.4450437 -0.4142557 -0.0442587 debye
polarizability: 459.7538859|14.6955425|246.7524347|-3.0622655|-6.9738733|98.0276778 unknown
InChI: InChI=1S/C20H12N2O2/c23-19-15-11-10-14-13-8-4-5-9-16(13)21-18(14)17(15)20(24)22(19)12-6-2-1-3-7-12/h1-11,21H
charge 0 multiplicity 1
36 atoms
O  1.059316 -1.945961 -0.112824
O  2.514289 2.566209 0.176635
N  -2.161545 -1.33892 -0.090795
N  2.186955 0.186128 0.020541
C  -1.504217 -0.117835 -0.008791
C  -0.140752 0.19031 0.01652
C  -2.479885 0.949512 0.056566
C  0.262911 1.540884 0.102159
C  -3.787221 0.303819 0.009365
C  -3.553086 -1.114573 -0.082573
C  1.046251 -0.686863 -0.032862
C  -2.048105 2.294936 0.144931
C  1.755142 1.57116 0.106692
C  -0.662616 2.601814 0.167737
C  -5.116873 0.787097 0.03555
C  3.558682 -0.247635 -0.003321
C  -4.609662 -2.044144 -0.148524
C  -6.179837 -0.13722 -0.030024
C  -5.926447 -1.535115 -0.121062
C  4.544327 0.548404 -0.640263
C  3.922259 -1.47417 0.608837
C  5.887205 0.116089 -0.654411
C  5.266891 -1.899275 0.575424
C  6.256222 -1.107963 -0.051503
H  -1.68222 -2.236928 -0.151956
H  -2.784499 3.103997 0.195261
H  -0.311389 3.635512 0.234699
H  -5.320549 1.861097 0.105604
H  -4.423842 -3.120742 -0.218625
H  -7.214595 0.220193 -0.011204
H  -6.770873 -2.231239 -0.170907
H  4.267053 1.4976 -1.103196
H  3.161407 -2.092442 1.089801
H  6.644663 0.738457 -1.143101
H  5.540066 -2.850125 1.045777
H  7.299778 -1.440269 -0.069857
