program: Gaussian 09
title: 000261068
version: EM64L-G09RevD.01
frameworkgroup: C1[X(C21H13NO2)]
method: RPBEPBE
basis: SDD
operation: Freq
keyword: #p
keyword: freq=noraman
keyword: PBEPBE/SDD
title: #p freq=noraman PBEPBE/SDD
converged: YES YES NO NO
title: Mulliken charges:
elementType: O O N C C C C C C C C C C C C C C C C C C C C C H H H H H H H H H H H H H
charge: -0.233050 -0.204131 -0.223694 0.108007 0.185328 0.237166 0.158134 0.211277 0.234104 -0.377618 -0.181258 -0.424596 0.274911 -0.285774 0.279618 -0.329994 -0.654028 -0.381343 -0.287152 -0.221089 -0.386144 -0.378554 -0.231666 -0.230119 0.253558 0.295756 0.320140 0.242383 0.244856 0.243639 0.228831 0.227422 0.225814 0.290993 0.291610 0.238058 0.238605
chargesum: 0.00000
title: Mulliken charges with hydrogens summed into heavy atoms:
elementType: O O N C C C C C C C C C C C C C C C C C C C C C
charge: -0.233050 -0.204131 -0.223694 0.108007 0.185328 0.237166 0.158134 0.211277 0.234104 -0.124060 -0.181258 -0.128841 0.274911 -0.285774 0.279618 -0.009854 0.076850 -0.152512 -0.059730 0.004725 -0.095151 -0.086943 0.006392 0.008486
polarizability: 4.41320340e+02 2.11157778e+01 2.92700769e+02 -1.96811681e-01 1.04514993e-01 9.22008853e+01
1716.lowfreq: -47.1484 -5.1613 -3.2419 -0.0010 -0.0004 -0.0002 1.6851 30.2467 42.1310
frequency: -47.0625 30.2072 42.1176 88.8889 118.5238 125.8550 135.3979 145.6803 169.6519 232.0373 249.9556 251.2057 283.6544 301.1231 314.1628 351.4248 376.9486 403.8412 415.7714 442.0474 445.8569 469.2555 480.8622 510.7732 531.1622 554.5770 572.5245 589.0052 604.7036 634.4506 655.3179 673.2963 688.9096 710.5858 729.7353 741.1957 764.0247 768.1359 782.8173 806.2756 815.3618 843.2625 860.0600 864.2328 883.6966 929.2824 945.0882 959.2335 983.9007 991.8293 997.5635 1011.0183 1014.5716 1026.2238 1029.9644 1051.9947 1085.7695 1099.3117 1118.0960 1127.6556 1142.8761 1162.6064 1167.7133 1171.2187 1186.9771 1206.5804 1246.4522 1270.0516 1292.0683 1316.4961 1333.0471 1360.4468 1387.7337 1398.9935 1406.0453 1426.1046 1434.9860 1443.2951 1451.2592 1465.0416 1470.6363 1472.4335 1474.1165 1491.8374 1528.9107 1534.0482 1572.8956 1577.6311 1588.8393 1601.1916 1610.5158 1627.9391 2981.8911 3057.8876 3123.6970 3128.9759 3135.1865 3143.8797 3147.2641 3151.1453 3161.3680 3162.8557 3168.2249 3171.7347 3216.0050
redmass: 1.0379 6.6975 5.7503 5.5748 4.4460 3.2475 5.5973 5.1011 6.3739 5.9968 5.1752 3.8942 5.6063 4.8073 5.7557 5.9947 9.8929 7.1990 3.3934 3.2023 4.8995 11.7457 7.1774 4.0163 6.3543 5.8003 4.0056 4.6734 6.2455 6.0263 6.7380 6.1186 3.9785 6.7105 2.3781 2.7976 1.7066 6.1815 3.8570 1.7180 6.2626 1.8092 4.6776 1.4280 1.9293 7.1831 2.3394 1.3602 5.6870 1.3792 1.4020 1.3090 1.3732 2.2601 2.3378 3.0378 2.6853 2.2537 1.3095 1.6015 2.3199 1.3907 1.2065 1.1462 2.0461 2.1239 1.8533 1.8360 3.5183 2.6329 2.8173 2.9120 4.0393 7.8203 6.9684 2.0097 3.5315 3.1521 2.9418 2.0397 2.6964 2.0971 1.2890 1.2459 8.1301 8.6436 6.8023 6.6693 7.3513 7.9426 6.9911 7.5364 1.0370 1.1020 1.0964 1.0859 1.0862 1.0917 1.0885 1.0903 1.0986 1.0945 1.0965 1.0998 1.0935
irintensity: 0.0248 5.1233 0.9863 1.0080 0.0285 2.4775 0.9385 3.4274 0.8466 1.0385 0.3588 0.2225 0.3897 0.0249 0.5230 0.3219 17.9951 11.5573 0.1145 7.4680 0.0616 0.8523 0.8219 0.0645 9.4527 8.8642 3.3885 0.9765 6.9704 5.0680 1.7658 4.9940 8.9275 1.1251 71.7576 17.8082 81.3855 2.7475 0.9165 9.7651 25.2851 48.2499 6.7764 0.6844 4.8265 16.4949 1.0133 2.2857 42.7394 0.3251 5.5556 1.9625 0.0093 25.7824 4.3832 7.5559 1.7840 18.8368 0.7061 1.3968 12.4078 35.6477 8.0166 0.2877 19.3228 16.7070 7.1880 19.0694 544.2671 158.3917 53.7627 304.4933 9.4767 0.6798 0.7476 0.4939 16.6229 1.7701 64.5382 60.8757 24.2747 39.3732 21.4033 90.0566 125.7822 106.9018 5.7813 15.5548 40.0082 47.8917 0.5060 32.5454 72.6578 22.8520 7.5219 0.8737 4.3472 20.8495 7.4967 8.2557 38.5035 2.8609 14.5962 30.0351 28.1643
temp: 298.150 k
press: 1.00000 atm
elementType: 8 8 7 6 6 6 6 6 6 6 6 6 6 6 6 6 6 6 6 6 6 6 6 6 1 1 1 1 1 1 1 1 1 1 1 1 1
symmnumber: 1
zpe: 732121.6 jmol-1
zpe.correction: 0.278850 hartree
zpe.thermalcorrener: 0.295930 hartree
zpe.thermalcorrenthalpy: 0.296875 hartree
zpe.thermalcorrgfe: 0.233903 hartree
zpe.sumelectzpe: -1011.684472 hartree
zpe.sumelectthermal: -1011.667392 hartree
zpe.sumelectthermalent: -1011.666448 hartree
zpe.sumelectthermalfe: -1011.729419 hartree
dipole: -3.3412 0.8406 0.0008
dipole: 3.4454
quadrupole: -103.2668 -131.3130 -143.2244
quadrupole: -21.6064 0.0120 0.0284
quadrupole: 22.6680 -5.3783 -17.2897 -21.6064 0.0120 0.0284
hfenergy: -1011.9633228 hartree
pointgroup: C01 [X(C21H13N1O2)]
dipole: 1.3095334 -0.3495666 0.0185219 debye
polarizability: 441.8177762|18.9687425|292.1250836|5.2304853|0.4715217|92.2791347 unknown
InChI: InChI=1S/C21H13NO2/c1-22-16-9-5-4-8-14(16)18-17(22)11-10-15-19(18)21(24)13-7-3-2-6-12(13)20(15)23/h2-11H,1H3
charge 0 multiplicity 1
37 atoms
O  -0.547053 2.208506 -0.051474
O  -3.048509 -2.697252 -0.103146
N  3.203857 -1.329586 -0.009912
C  1.158456 -0.211131 -0.034231
C  1.822682 -1.502858 -0.026215
C  -0.277276 -0.204389 -0.054622
C  2.241546 0.785422 -0.018219
C  3.485125 0.05061 -0.002518
C  -0.970625 -1.46523 -0.066425
C  1.134143 -2.733858 -0.034848
C  -1.083196 1.053398 -0.062687
C  -0.264026 -2.698722 -0.055861
C  -2.579392 0.955293 -0.085814
C  -2.459004 -1.565215 -0.090566
C  -3.24566 -0.299546 -0.100046
C  2.312829 2.205659 -0.015914
C  4.17569 -2.422611 0.002039
C  4.746185 0.680008 0.016494
C  3.570894 2.840893 0.001224
C  4.776356 2.090009 0.017639
C  -3.341629 2.150413 -0.094053
C  -4.66074 -0.351661 -0.12281
C  -4.749483 2.094811 -0.116491
C  -5.411865 0.840282 -0.131065
H  1.672902 -3.686115 -0.024197
H  -0.858121 -3.617275 -0.064789
H  1.389174 2.782405 -0.027093
H  5.194155 -2.010932 -0.048286
H  4.089287 -3.023111 0.926639
H  4.030268 -3.087622 -0.868919
H  5.678394 0.106196 0.031671
H  3.61776 3.935034 0.002497
H  5.74173 2.608368 0.032044
H  -2.805855 3.104322 -0.082687
H  -5.140316 -1.335377 -0.133548
H  -5.333489 3.02144 -0.122699
H  -6.506293 0.799425 -0.148615
