program: Gaussian 09
title: 000261112
version: EM64L-G09RevD.01
frameworkgroup: C1[X(C16H28N2O2Si2)]
method: RPBEPBE
basis: SDD
operation: Freq
keyword: #p
keyword: freq=noraman
keyword: PBEPBE/SDD
title: #p freq=noraman PBEPBE/SDD
converged: YES YES NO NO
title: Mulliken charges:
elementType: Si Si O O N N C C C C C C C C C C C C C C C C H H H H H H H H H H H H H H H H H H H H H H H H H H H H
charge: 1.275279 1.263297 -0.301345 -0.330585 -0.369317 -0.351971 -0.738006 -0.731471 -1.023095 -1.037133 -1.019635 -1.013072 -1.023515 -1.004406 0.122539 0.166350 0.121130 0.188984 -0.352419 -0.387795 -0.229266 -0.237515 0.270517 0.235249 0.274704 0.243097 0.236116 0.228246 0.251941 0.229910 0.227062 0.268184 0.232414 0.231351 0.239203 0.241279 0.234876 0.239076 0.226743 0.246267 0.235522 0.247190 0.233996 0.241020 0.369134 0.329411 0.284974 0.244482 0.236601 0.234402
chargesum: 0.00000
title: Mulliken charges with hydrogens summed into heavy atoms:
elementType: Si Si O O N N C C C C C C C C C C C C C C C C
charge: 1.275279 1.263297 -0.301345 -0.330585 -0.000184 -0.022560 -0.232240 -0.213670 -0.306793 -0.311976 -0.316666 -0.297841 -0.314983 -0.282200 0.122539 0.166350 0.121130 0.188984 -0.067445 -0.143313 0.007335 -0.003113
polarizability: 2.86456630e+02 -5.64482988e+00 2.92698246e+02 -8.12231707e+00 9.52029839e+00 1.76090539e+02
1716.lowfreq: -8.4617 -4.5594 -0.0012 -0.0011 -0.0010 7.0857 15.2120 17.7835 22.4148
frequency: 15.0656 17.5550 22.1737 26.2486 34.1204 44.1703 53.9356 70.6275 90.6174 103.4840 112.6549 115.9409 121.8140 126.9950 135.6400 141.3586 142.7355 152.0705 153.0689 161.8053 188.8727 189.6148 206.0542 208.0952 209.3783 215.3657 237.3576 241.6246 272.6006 296.0555 313.1618 322.8738 356.8821 394.2849 417.0182 451.3332 496.4164 558.9269 568.6225 571.1982 620.5270 634.6940 647.6146 667.6922 675.3441 685.2469 691.9163 693.7587 698.6219 702.4558 704.3505 714.5827 730.5891 740.6510 744.0200 778.1624 785.8787 798.4344 803.1581 816.2773 822.1155 850.8417 878.6261 888.2105 896.4486 903.7294 911.9576 920.6572 922.0260 924.5811 926.0042 969.5456 1000.8243 1002.3653 1007.7094 1053.9437 1089.2689 1147.2974 1154.4733 1177.3491 1219.1810 1222.0952 1244.8516 1249.8311 1264.8938 1282.1576 1291.0060 1293.2541 1295.0327 1297.5402 1299.0494 1305.8148 1310.8159 1367.0235 1416.6329 1428.7774 1430.6528 1441.4765 1443.0145 1445.0225 1445.8693 1446.9958 1450.7070 1453.9692 1454.5822 1457.2091 1458.4712 1461.3279 1464.8982 1467.6325 1492.8724 1544.2718 1558.7255 1569.7999 1599.9593 1606.8178 2973.5548 2975.9572 2977.7672 2979.4773 2980.8895 2981.6852 2984.0370 2988.3301 3059.0255 3066.5889 3074.7568 3076.9397 3078.3518 3080.0209 3081.4648 3081.5779 3083.1591 3084.2366 3085.3900 3085.7414 3090.1441 3090.6573 3121.1435 3139.0288 3157.0000 3171.1876 3259.2588 3549.2376
redmass: 3.4792 3.6011 3.1723 3.7169 3.6385 4.0617 6.1087 5.3685 4.0861 1.0673 1.0514 1.2483 1.3498 1.7972 2.9141 1.8659 1.4336 1.4289 2.5659 1.8773 2.5662 2.7350 2.6467 2.7281 2.6032 2.6581 3.2188 2.7781 4.6768 4.2694 3.4596 4.3335 5.4575 5.5663 4.4450 4.7253 4.9407 4.1227 3.8538 3.8614 1.2206 4.3504 3.7702 3.8330 2.7041 3.1569 3.9550 3.8288 3.2131 2.8633 3.0212 1.8658 1.8128 1.1748 1.1711 2.3517 1.9393 1.8015 1.6540 1.5375 1.6882 1.2116 1.6610 1.6219 1.4378 1.5241 1.4947 1.7523 1.6432 1.9522 1.7734 1.4182 3.0106 1.6589 5.0247 2.3946 3.1493 2.5824 2.4044 1.0654 1.1899 1.2409 1.4424 1.3018 1.4508 1.8653 1.2078 1.3657 1.2076 1.9196 1.2049 1.1935 1.1973 10.0069 2.0091 1.1126 1.1074 1.0545 1.0552 1.0583 1.0562 1.0558 1.0546 1.0537 1.0591 1.0495 1.0516 1.0590 2.1859 1.0553 2.1591 2.6446 7.6032 3.5531 3.5297 4.3763 1.0340 1.0347 1.0389 1.0554 1.0342 1.0345 1.0345 1.0605 1.0988 1.0988 1.0977 1.0982 1.0987 1.0980 1.0977 1.0982 1.0983 1.0983 1.0977 1.0981 1.0984 1.0981 1.0870 1.0892 1.0945 1.0988 1.0860 1.0776
irintensity: 0.0948 0.1493 0.2527 0.1989 0.3050 1.4533 3.6839 3.4775 2.0707 0.4213 0.2351 1.4480 1.1605 2.9912 1.1242 0.2287 0.3047 0.4344 1.4594 0.5135 4.4196 1.7181 1.7934 2.8243 0.7736 4.0424 1.2217 1.2723 5.8480 2.8420 19.4299 24.7310 4.8093 8.5966 2.6968 2.8628 3.5378 0.4515 2.3136 4.6097 105.6325 8.7748 2.7693 9.7001 3.0931 2.2878 8.8470 16.5112 6.9423 12.8575 14.2448 5.8793 3.2343 0.1440 0.3816 39.7957 33.1701 15.8910 10.5234 27.1839 33.5878 85.7749 3.9957 19.1346 2.0446 82.9659 157.5197 29.0119 203.0354 184.1704 172.4502 3.4751 10.1872 4.5791 22.4812 3.3576 4.0467 1.4208 0.8832 0.5484 20.4845 10.2975 1.3063 13.5712 2.8725 86.5926 36.8297 79.5230 29.6903 39.7214 43.3885 18.1537 10.9941 10.2645 3.6899 20.5460 34.2078 2.1118 0.2927 2.0458 1.9431 4.1283 5.0842 11.6411 12.5402 3.5081 6.7444 18.8435 27.5344 11.2409 225.8671 308.3957 144.7074 15.7232 44.3934 26.1408 16.0877 15.3210 7.2358 61.4987 7.7091 14.3640 9.8667 27.3417 5.2056 3.0347 22.3015 6.9797 3.5557 20.6017 44.1963 4.0933 15.7907 6.1197 37.2285 21.5662 15.1657 15.6576 6.9703 12.7421 12.8045 21.2072 400.1395 25.2293
temp: 298.150 k
press: 1.00000 atm
elementType: 14 14 8 8 7 7 6 6 6 6 6 6 6 6 6 6 6 6 6 6 6 6 1 1 1 1 1 1 1 1 1 1 1 1 1 1 1 1 1 1 1 1 1 1 1 1 1 1 1 1
symmnumber: 1
zpe: 1071726.1 jmol-1
zpe.correction: 0.408199 hartree
zpe.thermalcorrener: 0.437454 hartree
zpe.thermalcorrenthalpy: 0.438399 hartree
zpe.thermalcorrgfe: 0.344563 hartree
zpe.sumelectzpe: -1463.623486 hartree
zpe.sumelectthermal: -1463.594230 hartree
zpe.sumelectthermalent: -1463.593286 hartree
zpe.sumelectthermalfe: -1463.687121 hartree
dipole: -5.9791 -1.1430 0.8159
dipole: 6.1418
quadrupole: -145.7110 -140.4506 -152.4581
quadrupole: -9.7148 -7.8099 -2.2740
quadrupole: 0.4956 5.7559 -6.2516 -9.7148 -7.8099 -2.2740
hfenergy: -1464.0316846 hartree
pointgroup: C01 [X(C16H28N2O2Si2)]
dipole: 2.267133 0.5153701 0.6583511 debye
polarizability: 280.0447584|0.6077994|286.7141547|26.8279941|-27.5411553|188.486502 unknown
InChI: InChI=1S/C16H28N2O2Si2/c1-21(2,3)11-17-15(19)13-9-7-8-10-14(13)16(20)18-12-22(4,5)6/h7-10,17-18H,11-12H2,1-6H3
charge 0 multiplicity 1
50 atoms
Si -3.460874 2.407316 -0.564272
Si 3.942806 1.840778 0.810334
O  -3.507385 -1.567565 0.557841
O  0.315241 0.600282 -0.808799
N  -2.284907 -0.186966 -0.866379
N  1.437369 0.502939 1.217478
C  -3.458117 0.601061 -1.279023
C  2.0208 1.853385 1.102978
C  -3.271082 2.317218 1.336966
C  -2.000192 3.382446 -1.330229
C  -5.129854 3.221744 -1.038624
C  4.548596 3.655096 0.858774
C  4.763788 0.828133 2.216275
C  4.298936 1.031654 -0.883243
C  -2.390381 -1.203215 0.050763
C  0.635182 -0.055887 0.246325
C  -1.122651 -1.978455 0.401236
C  0.217545 -1.484736 0.511893
C  -1.363542 -3.342821 0.718046
C  1.257652 -2.380848 0.893269
C  -0.325514 -4.220032 1.085847
C  1.000492 -3.7387 1.165681
H  -4.356366 0.065258 -0.920656
H  -3.503974 0.640433 -2.3858
H  1.524899 2.344076 0.245615
H  1.775456 2.438588 2.011157
H  -2.284404 1.900032 1.611188
H  -3.357763 3.320366 1.79457
H  -4.045449 1.664137 1.778349
H  -2.144803 3.527645 -2.417244
H  -1.903538 4.381824 -0.865906
H  -1.048537 2.838374 -1.181999
H  -5.16948 4.270818 -0.690773
H  -5.278706 3.22456 -2.134566
H  -5.978292 2.680479 -0.580654
H  4.051778 4.262691 0.080138
H  4.341521 4.122138 1.83932
H  5.638756 3.710209 0.683089
H  4.429299 -0.226713 2.208083
H  5.86354 0.823616 2.100951
H  4.534528 1.25482 3.210574
H  3.880523 1.638314 -1.706493
H  5.385827 0.922614 -1.054168
H  3.841751 0.027077 -0.94661
H  -1.340833 0.09734 -1.187915
H  1.610354 -0.036899 2.067713
H  -2.403365 -3.681775 0.682776
H  2.288811 -2.010392 0.939953
H  -0.548366 -5.269179 1.307525
H  1.823029 -4.408983 1.437351
