program: Gaussian 09
title: 000261072
version: EM64L-G09RevD.01
frameworkgroup: C1[X(C24H26N6)]
method: RPBEPBE
basis: SDD
operation: Freq
keyword: #pfreq=noraman
keyword: PBEPBE/SDD
title: #p freq=noraman PBEPBE/SDD
converged: YES YES NO NO
title: Mulliken charges:
elementType: N N N N N N C C C C C C C C C C C C C C C C C C C C C C C C H H H H H H H H H H H H H H H H H H H H H H H H H H
charge: -0.227327 -0.192065 -0.232664 -0.104773 0.071026 0.022012 0.406376 0.437246 0.422887 0.088998 -0.322216 -0.389067 -0.641464 -0.382209 -0.355918 -0.355717 -0.351859 -0.348869 -0.402074 -0.220508 -0.223665 -0.676717 -0.634427 -0.272553 -0.220179 -0.221075 -0.205135 -0.222483 -0.262780 -0.253323 0.271979 0.240485 0.221874 0.266698 0.231715 0.218118 0.238684 0.298044 0.274866 0.247301 0.269562 0.228327 0.221851 0.243220 0.260266 0.238010 0.228657 0.266197 0.223503 0.227757 0.221178 0.225191 0.222760 0.228116 0.226216 0.229948
chargesum: 0.00000
title: Mulliken charges with hydrogens summed into heavy atoms:
elementType: N N N N N N C C C C C C C C C C C C C C C C C C C C C C C C
charge: -0.227327 -0.192065 -0.232664 -0.104773 0.071026 0.022012 0.406376 0.437246 0.422887 0.088998 -0.050237 -0.148582 0.078822 -0.164090 -0.117235 -0.057672 -0.076993 -0.101568 -0.132512 0.007819 -0.001814 0.064779 0.083930 -0.044797 0.000999 0.004116 0.017625 0.005633 -0.036564 -0.023376
polarizability: 5.25210107e+02 -2.90299970e+01 4.25132645e+02 4.49920636e+00 1.48079507e+01 2.11759530e+02
1716.lowfreq: -3.4555 -2.6613 -0.0005 -0.0004 0.0003 5.9839 16.4285 17.4776 22.1973
frequency: 16.4249 17.4517 22.1445 30.8959 36.1537 46.2334 50.5996 59.5299 74.2253 95.3124 103.6223 120.9208 125.0013 128.9930 147.4788 163.7964 180.2640 196.1771 201.1140 209.1955 235.5309 253.5533 282.6276 292.7073 294.9519 313.5209 338.7892 355.6027 369.0987 377.4644 393.8473 408.5070 410.4850 412.2536 413.3980 449.8833 482.3960 497.1379 517.4903 523.2524 532.1527 564.8405 587.0159 611.7129 612.7469 613.2100 623.2343 636.9227 693.7825 694.8804 696.6490 709.9537 741.7297 750.9041 754.8677 760.2341 763.0628 775.1286 828.0729 832.5495 833.6210 887.1586 895.4770 897.3241 905.8508 925.9757 942.1920 951.8402 962.3754 967.8034 968.5555 974.0261 979.2335 980.6831 981.4707 983.6059 989.4184 995.8515 996.7857 1024.0361 1025.5860 1027.3568 1076.2281 1082.6255 1085.6287 1090.2321 1097.2279 1102.0873 1107.5003 1119.3742 1120.4221 1169.7587 1170.4332 1172.2206 1177.2231 1188.0633 1190.3507 1191.7911 1192.3783 1199.4399 1281.8836 1290.6379 1297.7724 1309.5800 1322.9004 1325.0333 1329.9728 1360.8100 1378.1159 1380.5135 1386.1660 1391.7193 1418.0024 1424.2138 1427.8893 1443.5462 1445.4392 1446.1761 1457.6721 1464.6151 1466.5708 1474.8137 1477.1360 1477.7251 1480.1748 1488.8323 1492.6125 1498.3590 1533.9822 1564.7621 1577.5313 1582.7175 1589.9419 1604.8455 1606.9644 1611.9739 2958.9267 2965.2760 2965.9092 3036.7081 3048.3497 3053.6936 3057.2386 3067.3802 3111.5363 3117.9066 3123.9476 3124.7942 3126.8173 3132.2265 3133.2821 3134.7765 3136.4454 3150.6665 3152.0680 3152.3844 3161.2466 3163.1746 3164.6388 3171.3524 3175.2946 3178.2014
redmass: 5.0845 5.1465 5.2609 4.2536 3.8963 3.7966 4.9338 3.9690 3.3326 4.0598 3.5958 4.2203 3.4809 3.2025 1.1317 1.5464 1.3562 2.7358 3.3481 4.3140 4.6104 3.6347 3.7388 4.3655 4.0308 4.0619 3.9884 4.4857 3.5929 3.6187 4.3791 3.0038 4.7976 3.0987 3.0492 4.7429 3.7654 4.0646 3.1849 4.0942 4.6785 4.0108 4.8211 6.2806 6.3392 6.1469 5.4817 5.6629 2.2918 1.9494 1.9745 3.6060 5.4761 4.5188 1.8097 1.7590 1.9475 4.7622 1.2463 1.2623 1.2612 1.4173 1.4481 1.4772 1.4225 1.9962 2.2864 3.1514 1.3603 1.6440 1.5595 1.7318 4.3509 5.5965 1.4282 5.2905 1.3575 1.3202 3.8266 2.2859 2.1899 2.0915 2.1803 1.7553 1.6212 1.6520 1.9992 1.7993 1.4676 1.4844 1.4609 1.1187 1.0611 1.0672 2.0773 1.7457 1.1274 1.5906 1.1295 2.7585 3.0729 3.4151 2.5313 1.5412 1.3628 1.3626 1.4811 2.1332 5.7483 6.9133 8.1072 4.9498 1.2325 1.1667 1.2222 2.3502 2.3811 2.4285 2.2468 1.1145 1.1607 1.2200 1.6532 2.0163 2.1263 1.0842 1.0542 1.4404 6.0534 5.2725 6.1097 6.1764 6.3845 5.9675 5.9543 6.0687 1.0437 1.0372 1.0379 1.1009 1.0989 1.0849 1.0899 1.0873 1.0990 1.1008 1.0848 1.0848 1.0847 1.0906 1.0888 1.0887 1.0941 1.0931 1.0927 1.0926 1.0958 1.0979 1.0975 1.1003 1.0972 1.0963
irintensity: 0.1875 0.1359 0.1379 0.2431 1.4124 1.9602 0.7328 5.6488 3.3420 3.7348 5.8782 4.2460 2.4277 3.2673 0.8185 0.0480 5.1023 0.3223 2.1340 14.4454 0.5527 17.5397 11.3595 7.4277 5.6875 10.2776 2.1915 2.5394 4.6016 1.3743 7.3576 0.6772 0.8540 0.9056 2.3743 5.9589 9.9701 3.2778 17.8369 36.1394 5.7795 3.6107 33.7593 0.8946 0.8258 5.7948 9.1791 14.6087 38.0800 38.3779 27.8173 26.1227 3.0703 29.2915 54.0933 50.2236 55.9778 0.0744 1.8492 0.4789 6.4854 10.1690 2.3766 53.6423 5.3880 61.0915 107.4509 152.4941 0.3422 11.8741 13.6924 24.8430 20.0530 11.5336 0.2261 7.2844 5.2180 1.7532 21.7394 55.8610 43.3760 13.5429 107.5523 8.1584 10.2454 73.1647 134.3217 83.2976 19.0702 12.0983 5.7124 9.0584 0.2075 0.6111 60.4750 33.4994 9.3893 55.1165 7.4092 26.4364 292.2564 34.9936 126.0559 2.7129 28.3149 3.7069 2.7138 76.0497 9.4116 5.6868 5.1109 23.7537 7.9454 8.4631 14.4602 0.3063 1.1590 3.0690 69.8727 0.7080 19.7835 15.2170 184.7811 167.8862 54.4270 28.9571 15.1919 172.6019 256.7051 135.3298 17.0990 8.4352 13.9392 182.7705 37.3166 81.2042 104.0480 71.4423 62.2941 17.2835 30.3090 26.7437 26.2203 29.6103 8.8519 11.6933 9.3628 5.1495 6.3294 19.7210 7.7584 8.0916 3.2978 26.8011 26.1559 32.7422 31.7065 32.8900 23.4060 11.7285 13.1228 3.4875
temp: 298.150 k
press: 1.00000 atm
elementType: 7 7 7 7 7 7 6 6 6 6 6 6 6 6 6 6 6 6 6 6 6 6 6 6 6 6 6 6 6 6 1 1 1 1 1 1 1 1 1 1 1 1 1 1 1 1 1 1 1 1 1 1 1 1 1 1
symmnumber: 1
zpe: 1183924.6 jmol-1
zpe.correction: 0.450933 hartree
zpe.thermalcorrener: 0.479334 hartree
zpe.thermalcorrenthalpy: 0.480279 hartree
zpe.thermalcorrgfe: 0.388524 hartree
zpe.sumelectzpe: -1256.388195 hartree
zpe.sumelectthermal: -1256.359793 hartree
zpe.sumelectthermalent: -1256.358849 hartree
zpe.sumelectthermalfe: -1256.450603 hartree
dipole: 0.8107 0.1298 -1.7285
dipole: 1.9135
quadrupole: -147.7496 -168.0077 -172.7804
quadrupole: -3.0995 -5.6698 2.0950
quadrupole: 15.0963 -5.1618 -9.9345 -3.0995 -5.6698 2.0950
hfenergy: -1256.8391277 hartree
pointgroup: C01 [X(C24H26N6)]
dipole: 0.1977594 -0.07369 -0.7226607 debye
polarizability: 511.136723|-40.938952|433.5624014|-42.6709073|-6.8989941|217.4031581 unknown
InChI: InChI=1S/C24H26N6/c1-28(22-13-7-4-8-14-22)25-19-21(27-30(3)24-17-11-6-12-18-24)20-26-29(2)23-15-9-5-10-16-23/h4-20H,1-3H3
charge 0 multiplicity 1
56 atoms
N  0.75057 -3.412043 -0.481519
N  2.021935 1.341585 -1.38323
N  -3.149488 1.162607 -0.119972
N  -0.418913 -2.650743 -0.28435
N  0.968623 0.683225 -0.804923
N  -1.916078 0.594923 -0.408138
C  2.045998 -3.117162 0.037936
C  2.137824 2.727133 -1.045524
C  -4.226043 0.582907 0.625169
C  -0.386359 -1.309267 -0.474918
C  2.250557 -2.138312 1.055601
C  3.167523 -3.863869 -0.429245
C  0.435512 -4.798763 -0.877728
C  3.320984 3.46346 -1.323061
C  -5.570791 0.823011 0.225779
C  1.043809 3.382158 -0.410093
C  -3.984728 -0.162059 1.816285
C  0.767016 -0.601728 -1.042807
C  -1.669824 -0.682308 -0.15173
C  3.540841 -1.920473 1.57773
C  4.453115 -3.634193 0.10572
C  2.934636 0.66467 -2.320544
C  -3.348886 2.446573 -0.813704
C  4.654666 -2.659222 1.109612
C  3.396516 4.834019 -0.988063
C  -6.644581 0.324007 0.99391
C  1.139188 4.746486 -0.077007
C  -5.065242 -0.661303 2.569962
C  2.310583 5.488391 -0.366534
C  -6.40186 -0.427253 2.165827
H  1.404639 -1.568362 1.447125
H  3.036293 -4.610919 -1.218825
H  0.663341 -4.983256 -1.945687
H  -0.646026 -4.936142 -0.724208
H  0.997028 -5.524732 -0.262674
H  4.197117 2.982683 -1.768973
H  -5.775077 1.389861 -0.688333
H  0.148901 2.795016 -0.187776
H  -2.960841 -0.315309 2.168958
H  1.435496 -1.227712 -1.655037
H  -2.409569 -1.384919 0.261175
H  3.673842 -1.169084 2.364485
H  5.300743 -4.218854 -0.27051
H  2.34617 0.136887 -3.09601
H  3.573508 -0.075094 -1.799806
H  3.570499 1.402707 -2.826288
H  -3.977161 3.116586 -0.202526
H  -2.355526 2.896388 -0.963696
H  -3.820996 2.318923 -1.809101
H  5.653554 -2.480891 1.521209
H  4.318186 5.385324 -1.206824
H  -7.673253 0.517985 0.669278
H  0.288708 5.23729 0.410488
H  -4.861249 -1.22525 3.487179
H  2.376263 6.550367 -0.107377
H  -7.236192 -0.818447 2.757414
