program: Gaussian 09
title: 000270949
version: EM64L-G09RevD.01
frameworkgroup: C1[X(C10H14N2O)]
method: RPBEPBE
basis: SDD
operation: Freq
keyword: #p
keyword: freq=noraman
keyword: PBEPBE/SDD
title: #p freq=noraman PBEPBE/SDD
converged: NO YES NO NO
title: Mulliken charges:
elementType: O N N C C C C C C C C C C H H H H H H H H H H H H H H
charge: -0.295170 -0.503770 -0.413606 0.466257 0.449725 -0.447835 -0.341361 -0.374058 -0.382304 -0.336768 0.308807 -0.811079 -0.631969 0.208160 0.305842 0.226461 0.226165 0.211992 0.212075 0.279307 0.280442 0.224326 0.220162 0.232585 0.243516 0.243338 0.198761
chargesum: 0.00000
title: Mulliken charges with hydrogens summed into heavy atoms:
elementType: O N N C C C C C C C C C C
charge: -0.295170 -0.224463 -0.133164 0.466257 0.449725 -0.239676 -0.035519 -0.147596 -0.156138 0.087299 0.308807 -0.134007 0.053647
polarizability: 2.05558924e+02 -5.83424856e+00 1.24468988e+02 5.96457338e-01 -3.73229722e-03 6.59545030e+01
1716.lowfreq: -110.4806 -24.1972 -0.0006 -0.0004 -0.0003 1.4844 7.6524 21.0900 29.9891
frequency: -110.4789 -23.8955 29.7386 42.7352 77.8577 99.1595 144.6010 224.8558 267.4681 270.6337 314.5776 317.1579 379.2085 399.1621 409.0579 410.6830 516.6886 547.5213 592.6311 635.2509 694.1145 714.8576 749.0036 755.6166 799.1865 814.3308 824.8705 854.0588 889.5177 936.2389 971.9332 986.9502 988.6022 1008.6140 1046.0147 1088.5206 1123.6135 1128.7346 1142.3211 1192.1044 1222.5926 1234.6704 1273.8842 1289.7200 1309.2785 1343.2348 1363.5560 1396.4566 1402.2848 1411.3218 1461.1707 1467.8267 1471.8318 1473.1063 1487.6445 1497.7274 1515.4430 1531.1686 1594.2273 1630.8774 1655.2746 2949.3865 2970.3306 2987.6979 2999.7050 3050.3633 3079.9360 3097.1315 3099.6878 3121.9780 3131.3419 3133.5890 3194.3480 3518.3940 3531.8304
redmass: 2.0610 1.0268 3.1249 3.8342 4.1892 3.9798 3.2971 3.7669 5.3176 1.0852 4.0812 2.6500 3.9433 1.5930 3.5027 3.2068 2.4365 4.6606 1.1844 6.8842 11.7259 3.0293 5.6047 4.1775 1.1157 1.4872 4.7855 1.2897 4.8365 1.3413 2.4230 1.3473 1.4369 2.8603 1.5357 2.7201 2.0248 1.5191 1.5045 1.1073 2.4697 2.1926 2.5324 1.0946 1.4517 1.3380 4.4157 1.2264 1.2116 3.8031 1.0408 1.1673 1.0537 1.0524 1.1776 1.7142 2.9295 1.5155 5.1891 6.2263 4.3956 1.0575 1.0387 1.1051 1.0411 1.0948 1.0995 1.0877 1.0943 1.0909 1.0955 1.1013 1.0940 1.0764 1.0753
irintensity: 0.6190 0.6799 2.2599 2.2399 6.7840 1.3045 2.1983 7.1920 0.8137 0.0529 9.5570 2.6977 2.1696 4.2313 2.1241 0.8528 50.9417 2.2450 167.9840 0.8102 15.9721 0.9340 2.5892 0.1225 2.5771 59.1788 0.5233 23.8294 1.5436 3.7301 0.8977 3.9059 1.2253 0.7640 20.8010 30.8483 23.6056 13.6499 6.2168 5.9963 42.1236 355.9708 11.8180 0.2061 46.3831 187.1977 132.7373 5.3007 35.9218 14.6110 10.2659 87.6744 34.9233 12.1300 49.0699 65.3293 401.0562 207.2930 30.0464 26.0178 162.2450 96.3773 52.3766 43.0093 49.3025 26.3680 20.2675 25.2732 36.8590 28.2291 18.8059 25.2984 5.7075 6.3081 12.1929
temp: 298.150 k
press: 1.00000 atm
elementType: 8 7 7 6 6 6 6 6 6 6 6 6 6 1 1 1 1 1 1 1 1 1 1 1 1 1 1
symmnumber: 1
zpe: 587888.1 jmol-1
zpe.correction: 0.223915 hartree
zpe.thermalcorrener: 0.236086 hartree
zpe.thermalcorrenthalpy: 0.237030 hartree
zpe.thermalcorrgfe: 0.184272 hartree
zpe.sumelectzpe: -573.234869 hartree
zpe.sumelectthermal: -573.222698 hartree
zpe.sumelectthermalent: -573.221754 hartree
zpe.sumelectthermalfe: -573.274512 hartree
dipole: -1.3212 4.0305 0.0654
dipole: 4.2420
quadrupole: -61.7967 -70.0911 -82.4336
quadrupole: -8.6082 0.2242 0.0053
quadrupole: 9.6438 1.3493 -10.9931 -8.6082 0.2242 0.0053
hfenergy: -573.4587837 hartree
pointgroup: C01 [X(C10H14N2O1)]
dipole: 0.5256176 1.5837741 -0.0266388 debye
polarizability: 205.6015768|5.5360208|124.4271629|0.4872005|-0.0220014|65.953676 unknown
InChI: InChI=1S/C10H14N2O/c1-3-11-10(13)12-9-6-4-8(2)5-7-9/h4-7,11-12H,3H2,1-2H3
charge 0 multiplicity 1
27 atoms
O  1.861342 -1.20861 0.005173
N  0.722868 0.857091 0.003842
N  3.053401 0.83187 -0.001477
C  -0.633288 0.427083 0.00683
C  -3.418089 -0.265515 0.013559
C  -1.636108 1.435257 0.006127
C  -1.031553 -0.93658 0.014496
C  -3.00188 1.09034 0.010689
C  -2.405399 -1.257732 0.019208
C  4.46553 0.37805 -0.00608
C  1.88994 0.057142 0.003826
C  -4.890891 -0.637529 -0.014408
C  4.705379 -1.142872 -0.007046
H  -1.3448 2.494815 0.006505
H  -0.266836 -1.714701 0.020365
H  -3.754949 1.888033 0.013408
H  -2.694865 -2.316216 0.028507
H  4.960075 0.814174 -0.899156
H  4.966025 0.814082 0.883718
H  0.843143 1.872083 0.000583
H  2.944002 1.848071 -0.002285
H  -5.075507 -1.595967 0.502633
H  -5.513776 0.135417 0.470314
H  -5.257793 -0.750673 -1.053622
H  4.273346 -1.627429 0.881298
H  4.266813 -1.627297 -0.892283
H  5.799369 -1.309589 -0.011122
