program: Gaussian 09
title: 000270963
version: EM64L-G09RevD.01
frameworkgroup: C1[X(C10H13NO2)]
method: RPBEPBE
basis: SDD
operation: Freq
keyword: #p
keyword: freq=noraman
keyword: PBEPBE/SDD
title: #p freq=noraman PBEPBE/SDD
converged: YES YES NO NO
title: Mulliken charges:
elementType: O O N C C C C C C C C C C H H H H H H H H H H H H H
charge: -0.461576 -0.295200 -0.338471 -0.221820 -0.419195 0.428684 -0.369093 -0.398350 -0.227839 -0.255804 -0.240731 0.279746 -0.767571 0.219657 0.254670 0.224795 0.310164 0.265962 0.262899 0.224759 0.230974 0.346717 0.227677 0.251426 0.254844 0.212677
chargesum: 0.00000
title: Mulliken charges with hydrogens summed into heavy atoms:
elementType: O O N C C C C C C C C C C
charge: -0.114859 -0.295200 -0.028307 -0.002163 0.060269 0.428684 -0.103132 -0.135451 -0.003081 -0.024830 -0.013054 0.279746 -0.048624
polarizability: 1.22819388e+02 -4.60117474e+00 1.30946243e+02 1.53615564e+01 5.84467948e+00 9.12639819e+01
1716.lowfreq: -8.0476 -0.0008 -0.0006 -0.0005 6.7645 10.8052 29.6598 50.8653 63.2062
frequency: 29.6463 50.7805 63.1925 78.5244 103.9804 149.0245 189.1189 242.6778 264.2270 315.9952 357.4445 403.5340 412.4782 424.7687 466.3904 527.4065 588.8757 597.9363 616.7743 642.2161 684.8993 704.3262 735.9625 795.3958 860.4185 866.3966 897.6690 935.0813 972.5094 984.3279 990.1546 999.2456 1001.1301 1029.8154 1040.2484 1045.7944 1093.9333 1126.9396 1153.1167 1172.4877 1195.5625 1206.8853 1229.5495 1250.6928 1284.9816 1327.7369 1351.5031 1380.7878 1382.9684 1388.7603 1435.7522 1450.2685 1465.3526 1479.4893 1487.6541 1491.9185 1592.5768 1611.5052 1615.7799 2934.4368 2972.0124 2997.2944 3068.1372 3097.3437 3102.7100 3123.3167 3133.2829 3145.3014 3158.9883 3170.9846 3548.2008 3559.7002
redmass: 4.0414 3.6827 4.4549 1.2317 3.6479 4.0116 5.1107 5.7475 4.1618 1.1009 2.8403 2.8535 2.9118 3.7785 3.2041 3.3405 3.1560 3.9351 6.2235 1.2787 4.2059 2.0530 1.9812 2.4860 1.2668 3.0150 2.8792 1.5918 2.3391 1.4847 4.0854 1.3625 1.8218 2.3104 1.8573 1.9374 1.6865 3.4361 1.4268 1.0542 1.1654 1.2259 1.2170 1.8455 1.5723 1.3082 1.5016 7.1779 1.4462 1.2759 2.2352 1.0490 1.1213 1.2051 2.0851 1.8411 6.0544 6.2488 6.0046 1.0820 1.0713 1.0358 1.0912 1.0987 1.1002 1.0848 1.0886 1.0938 1.0974 1.0978 1.0776 1.0662
irintensity: 0.0388 0.8760 8.9589 4.6536 14.1951 1.9537 4.0623 1.3738 6.9991 139.1948 0.6922 0.1082 6.7493 4.8500 16.1648 1.1385 39.8524 5.0537 0.1480 102.3416 32.8876 56.0386 43.6547 25.6376 2.7268 18.3193 15.8844 7.9299 0.6381 0.1661 0.1813 1.0429 5.1493 16.3239 26.1844 39.7981 3.8816 8.9742 63.4217 0.3081 9.5046 9.9691 15.8635 42.5985 36.3485 1.9396 21.5436 0.5467 33.4892 46.5598 13.2484 18.9544 64.9639 34.9851 110.4425 55.5112 0.9942 139.5644 16.3404 33.1664 86.7654 10.4675 10.0856 12.6838 16.6570 0.4190 9.0856 19.1991 23.5896 12.8042 30.1112 3.3573
temp: 298.150 k
press: 1.00000 atm
elementType: 8 8 7 6 6 6 6 6 6 6 6 6 6 1 1 1 1 1 1 1 1 1 1 1 1 1
symmnumber: 1
zpe: 557796.4 jmol-1
zpe.correction: 0.212453 hartree
zpe.thermalcorrener: 0.225378 hartree
zpe.thermalcorrenthalpy: 0.226322 hartree
zpe.thermalcorrgfe: 0.171755 hartree
zpe.sumelectzpe: -593.095913 hartree
zpe.sumelectthermal: -593.082989 hartree
zpe.sumelectthermalent: -593.082045 hartree
zpe.sumelectthermalfe: -593.136612 hartree
dipole: 0.4165 3.0443 1.3511
dipole: 3.3566
quadrupole: -78.5110 -67.4766 -77.6160
quadrupole: -7.9528 -5.6860 -5.8959
quadrupole: -3.9765 7.0579 -3.0815 -7.9528 -5.6860 -5.8959
hfenergy: -593.3083669 hartree
pointgroup: C01 [X(C10H13N1O2)]
dipole: 0.0402391 -0.9243021 0.9423328 debye
dipolederiv: -0.6395465 -0.0865217 -0.0625362 -0.1048663 -0.3293824 0.2222175 -0.0568883 0.3492313 -0.6473216 -0.5511604 -0.0955221 -0.0333364 -0.1769212 -0.5784406 0.0350543 0.0703339 0.2368962 -0.9730715 -0.7764759 -0.211709 0.1192493 -0.3068511 -0.9385132 0.2644717 0.1697247 0.1466781 -0.4340482 0.5437748 -0.0562109 0.0454077 -0.0244876 0.4235564 -0.155201 0.1041393 -0.27815 0.548539 0.247553 0.0177584 0.040787 0.0335387 0.3650048 0.0668805 0.1255392 0.3113924 -0.0092518 -0.035265 -0.0250922 -0.0379432 -0.1512788 0.0583296 0.0370787 -0.0097038 0.0332902 -0.079753 -0.1230788 -0.0365945 0.0171579 0.0562155 -0.0732493 -0.1012637 -0.0199881 -0.1094861 -0.0127362 -0.0590382 0.0094118 -0.0815829 0.0067779 -0.1159466 -0.0293672 -0.0794671 -0.0247613 -0.0616656 -0.0196526 -0.0366966 -0.1369361 -0.0407836 -0.0875004 -0.0209259 -0.1313393 -0.0226805 0.0216645 -0.1116773 -0.0241384 -0.0377644 -0.0440994 0.007792 -0.1197045 -0.0184576 -0.1234755 0.0098152 -0.0335543 -0.1205309 -0.0360199 -0.1055616 -0.0071704 -0.0303095 -0.0370763 -0.0211486 -0.0936303 0.5367173 0.4256183 0.0202137 0.6433885 1.1347025 -0.2848585 -0.0989731 -0.3828486 1.1397614 -0.071696 -0.1373465 -0.0938526 -0.198585 -0.2348375 -0.1545565 -0.0900942 -0.1454465 -0.0494986 -0.0610251 -0.04115 -0.0353008 -0.01738 -0.1889525 -0.0799875 -0.0572649 -0.0209769 -0.0559723 0.1261687 -0.0129547 -0.0217026 0.0039815 0.1286153 0.0866535 -0.0881419 -0.0286564 -0.0050095 -0.0697369 0.0877068 0.019958 0.0485736 -0.2167064 -0.0237449 -0.050854 -0.0107353 0.1051968 0.3581973 -0.0625717 -0.0042166 -0.052655 0.1966116 -0.0074949 -0.0508087 -0.0492644 0.1264568 0.1515254 0.0031525 0.009173 -0.0001595 0.0442388 0.0912371 0.0270534 0.0901952 0.0373668 0.0946352 0.0190208 0.10505 0.0186513 0.0999759 0.0074041 0.1020731 0.0047124 0.0396191 -0.0056439 0.0368478 0.1299277 0.0339329 0.1060637 0.0177703 0.1415456 0.0145119 -0.0143352 0.1083324 0.0195872 0.0303685 0.0404422 0.0003658 0.1196029 0.016157 0.1246195 0.0046979 0.2877904 0.1700703 -0.0087108 0.1541449 0.0734238 -0.0446572 0.0168305 -0.137646 0.274781 0.0041829 0.1347933 0.0276217 0.1465011 -0.0115619 0.0170975 0.0318567 0.016951 0.11096 -0.0662459 -0.0630703 0.0440499 -0.0271226 0.1175528 0.0019414 0.080788 0.0008684 0.0604356 0.0633642 0.1123437 -0.0090809 0.0685383 -0.0210605 -0.0080492 -0.0411106 0.0008539 0.0881323 0.1015553 -0.0262017 -0.009981 -0.0039344 0.0470891 0.0927109 -0.0558735 0.0250755 -0.1311328 unknown
polarizability: 117.6334698|-13.1989642|121.292581|-15.6825083|-15.7393655|106.1035622 unknown
InChI: InChI=1S/C10H13NO2/c1-8(12)11-7-10(13)9-5-3-2-4-6-9/h2-6,10-11,13H,7H2,1H3
charge 0 multiplicity 1
26 atoms
O  0.217446 -2.210107 1.507075
O  2.34294 0.868962 -1.804552
N  2.033864 -0.41954 0.106552
C  -0.047657 -1.781478 0.105486
C  1.301472 -1.481512 -0.583624
C  -1.02583 -0.609643 0.167141
C  -1.990154 -0.562416 1.205377
C  -1.036699 0.399902 -0.828985
C  -2.952096 0.470896 1.245594
C  -2.003103 1.43049 -0.789874
C  -2.965776 1.46974 0.244457
C  2.486934 0.712879 -0.550688
C  3.165013 1.758525 0.327525
H  -0.52418 -2.625448 -0.443027
H  1.173818 -1.159583 -1.631567
H  1.899652 -2.416648 -0.59785
H  2.08283 -0.482752 1.125552
H  -1.962121 -1.329623 1.984632
H  -0.288267 0.40424 -1.628857
H  -3.689289 0.496306 2.056297
H  -1.996526 2.205238 -1.564667
H  0.587767 -3.129214 1.492447
H  -3.713146 2.270808 0.272707
H  4.165222 1.979644 -0.082314
H  2.580348 2.694089 0.287493
H  3.268138 1.447742 1.38137
