program: Gaussian 09
title: 000270950
version: EM64L-G09RevD.01
frameworkgroup: C1[X(C11H16N2O)]
method: RPBEPBE
basis: SDD
operation: Freq
keyword: #p
keyword: freq=noraman
keyword: PBEPBE/SDD
title: #p freq=noraman PBEPBE/SDD
converged: YES YES NO NO
title: Mulliken charges:
elementType: O N N C C C C C C C C C C C H H H H H H H H H H H H H H H H
charge: -0.297602 -0.421292 -0.492144 -0.337549 -0.338997 0.476036 -0.678775 0.452360 0.282262 -0.449188 -0.344816 -0.405806 -0.353646 -0.811756 0.251432 0.206328 0.182124 0.227737 0.277814 0.219664 0.204918 0.220865 0.283197 0.210007 0.305681 0.227071 0.226255 0.219992 0.229313 0.228518
chargesum: 0.00000
title: Mulliken charges with hydrogens summed into heavy atoms:
elementType: O N N C C C C C C C C C C C
charge: -0.297602 -0.143478 -0.208947 0.120210 0.070863 0.476036 -0.033329 0.452360 0.282262 -0.239182 -0.039135 -0.178735 -0.127391 -0.133934
polarizability: 2.23640359e+02 6.46526161e+00 1.30821268e+02 -7.95483273e+00 4.14516518e+00 7.84414333e+01
1716.lowfreq: -0.0009 -0.0008 -0.0004 3.2436 8.9221 13.0658 23.5547 34.6347 41.4437
frequency: 21.0987 34.3143 41.3814 53.8348 72.8939 81.8299 129.3998 155.8089 224.7337 247.3112 258.6609 278.2959 317.8841 330.5246 370.5060 379.5168 409.0654 456.5916 514.4082 564.0393 578.5322 632.8119 696.0118 701.8609 715.5862 753.5101 764.8054 815.3895 838.8249 854.2331 869.6868 890.3628 936.1874 961.9587 987.5494 989.1161 1009.0897 1046.3999 1047.0075 1110.2096 1112.2107 1128.3467 1145.9492 1192.3382 1210.7243 1223.7696 1249.1400 1270.3367 1301.5813 1307.4847 1312.0172 1362.0673 1369.7626 1390.3815 1397.9665 1411.5683 1451.4830 1470.6279 1470.9287 1472.7709 1478.2124 1485.7981 1489.0453 1506.5590 1516.4259 1594.8316 1630.3290 1644.3523 2972.4874 2976.0151 2977.9434 2987.7237 3036.6795 3049.4760 3069.3438 3078.7082 3079.0952 3082.1138 3099.4845 3120.8959 3134.7425 3192.0738 3524.0682 3547.6444
redmass: 2.8966 2.5294 1.2808 4.0443 1.9507 4.5427 3.7323 3.2283 1.1153 3.9561 2.5442 2.4748 2.5129 3.8611 2.3854 2.6607 2.9492 4.6780 2.3548 4.3563 1.2467 6.5807 2.6751 10.4871 3.0110 1.3282 4.1370 1.4809 5.2032 1.2968 1.4623 1.7368 1.3499 3.4141 1.3181 1.4381 2.9030 3.2015 1.5300 3.5334 2.2948 1.3155 1.6846 1.1071 1.9241 2.4818 1.3249 2.3656 1.1525 1.2831 1.4264 2.4678 1.7851 1.2098 1.2336 3.8635 1.1152 1.1567 1.0745 1.0706 1.0828 1.1095 1.3729 2.0366 2.9855 5.3764 5.8850 4.4742 1.0371 1.0482 1.0500 1.0666 1.0957 1.0977 1.0985 1.0986 1.0999 1.1009 1.0881 1.0908 1.0955 1.0941 1.0761 1.0770
irintensity: 0.2087 2.5440 0.0324 7.6783 1.6145 2.3421 3.7765 2.2059 0.1961 0.4742 2.5407 1.3588 11.7663 14.4776 8.2230 13.3251 0.0191 10.6134 69.5577 0.2472 132.7455 1.9222 3.3860 13.3482 0.6295 7.7686 1.5869 59.3117 0.8456 24.1728 5.9574 12.1992 3.3711 0.9655 4.3950 1.5476 2.1383 0.4511 11.1307 7.0804 8.3744 16.6686 1.5811 0.4604 292.9070 9.5346 92.6736 18.0971 11.2154 16.1463 53.9998 91.2088 44.6816 8.1101 2.3116 15.4478 22.2891 22.9275 16.0488 2.2839 68.1919 41.9082 148.1684 269.5035 493.2126 49.1191 27.5660 139.9679 54.6028 42.1992 20.2877 71.6474 8.8998 24.2282 21.0643 21.2141 42.7303 51.9054 24.8360 24.4792 21.4788 5.9247 5.5038 17.8975
temp: 298.150 k
press: 1.00000 atm
elementType: 8 7 7 6 6 6 6 6 6 6 6 6 6 6 1 1 1 1 1 1 1 1 1 1 1 1 1 1 1 1
symmnumber: 1
zpe: 661934.1 jmol-1
zpe.correction: 0.252117 hartree
zpe.thermalcorrener: 0.267316 hartree
zpe.thermalcorrenthalpy: 0.268261 hartree
zpe.thermalcorrgfe: 0.207317 hartree
zpe.sumelectzpe: -612.467168 hartree
zpe.sumelectthermal: -612.451969 hartree
zpe.sumelectthermalent: -612.451025 hartree
zpe.sumelectthermalfe: -612.511968 hartree
dipole: 1.1693 3.8706 0.6752
dipole: 4.0994
quadrupole: -69.8513 -76.7602 -89.3101
quadrupole: 6.4456 -0.3623 -0.4873
quadrupole: 8.7892 1.8804 -10.6696 6.4456 -0.3623 -0.4873
hfenergy: -612.7192856 hartree
pointgroup: C01 [X(C11H16N2O1)]
dipole: -0.4475125 1.5007784 -0.385423 debye
polarizability: 223.607939|-7.6837209|129.967062|-6.7576301|-8.139308|79.328059 unknown
InChI: InChI=1S/C11H16N2O/c1-3-8-12-11(14)13-10-6-4-9(2)5-7-10/h4-7,12-13H,3,8H2,1-2H3
charge 0 multiplicity 1
30 atoms
O  -1.393156 -1.101653 0.608576
N  -2.569564 0.897534 0.318004
N  -0.235951 0.90075 0.105979
C  -3.883059 0.266689 0.518797
C  -4.634603 -0.029141 -0.800931
C  1.111415 0.447394 0.041535
C  -6.009812 -0.680917 -0.541417
C  3.871926 -0.309972 -0.127595
C  -1.393621 0.142061 0.357915
C  2.114932 1.413916 -0.234118
C  1.494236 -0.907709 0.234323
C  3.471084 1.036166 -0.315783
C  2.85563 -1.261803 0.146511
C  5.331956 -0.722218 -0.211761
H  -3.698651 -0.67803 1.059158
H  -4.501502 0.916662 1.169207
H  -4.767643 0.911753 -1.373088
H  -4.006809 -0.697115 -1.4202
H  -2.547901 1.874379 0.021783
H  -5.897976 -1.638811 -0.000362
H  -6.65804 -0.022649 0.068024
H  -6.53787 -0.889239 -1.489138
H  -0.35627 1.905885 -0.035566
H  1.835204 2.465408 -0.386249
H  0.72577 -1.65208 0.449782
H  4.227296 1.801248 -0.529318
H  3.13433 -2.31246 0.298043
H  5.981139 0.137483 -0.452954
H  5.686373 -1.15182 0.744593
H  5.490938 -1.491909 -0.990649
