program: Gaussian 09
title: 000270956
version: EM64L-G09RevD.01
frameworkgroup: C1[X(C13H10N2)]
method: RPBEPBE
basis: SDD
operation: Freq
keyword: #pfreq=noraman
keyword: PBEPBE/SDD
title: #p freq=noraman PBEPBE/SDD
converged: YES YES NO NO
title: Mulliken charges:
elementType: N N C C C C C C C C C C C C C H H H H H H H H H H
charge: 0.003822 -0.003974 -0.349722 0.420777 0.467249 -0.380527 -0.400471 -0.294943 -0.498151 -0.222840 -0.223118 -0.240490 -0.205924 -0.178154 -0.330742 0.256354 0.239624 0.254877 0.256023 0.250420 0.231280 0.232533 0.233877 0.235368 0.246852
chargesum: 0.00000
title: Mulliken charges with hydrogens summed into heavy atoms:
elementType: N N C C C C C C C C C C C C C
charge: 0.003822 -0.003974 -0.093368 0.420777 0.467249 -0.140902 -0.145594 -0.038920 -0.247731 0.008440 0.009415 -0.006613 -0.205924 0.057214 -0.083890
polarizability: 1.69176716e+02 -8.36309423e+00 1.35738510e+02 -1.17850557e+01 8.61511513e+00 1.11824502e+02
1716.lowfreq: -8.6107 -0.0005 0.0006 0.0008 1.9996 7.1912 12.4825 20.4989 60.4708
frequency: 9.9201 19.9086 60.4580 102.8936 124.5619 197.6082 226.4880 279.9885 326.0422 383.7215 399.6033 402.6398 450.7350 466.7855 536.4280 604.5867 616.2047 636.5241 662.9774 704.5777 721.7908 746.3381 808.3745 820.0810 847.3451 856.6885 921.4015 930.7890 943.8937 973.7004 981.9753 990.8165 992.7680 1000.8963 1005.6376 1029.1921 1030.0854 1088.8417 1113.7345 1175.1564 1180.0194 1189.8755 1195.0694 1215.7622 1223.2787 1264.8590 1312.5038 1329.2483 1344.0346 1382.9282 1416.1451 1438.9724 1457.1143 1483.0910 1559.1357 1583.4554 1595.4974 1612.8228 2194.3857 2975.6053 3108.3723 3122.8279 3130.4669 3134.9149 3141.0109 3142.3353 3151.5150 3167.7113 3169.8118
redmass: 3.9945 4.9225 5.0435 7.0219 8.3273 4.3849 4.1214 5.2520 5.8029 3.8805 4.5798 2.8248 7.7955 3.7863 4.9519 7.7681 6.4442 6.5135 5.4085 1.9051 1.8359 2.0546 2.2043 2.8582 3.5523 1.2576 1.4116 1.4427 1.5629 3.6296 1.4042 2.5530 2.1354 1.3183 3.8515 2.2891 2.9562 1.6070 1.6752 1.0596 2.0835 1.7554 1.1183 1.3200 2.1079 1.4793 5.9959 1.2899 1.2302 8.3326 2.0652 2.2168 2.0923 2.2152 5.6851 5.8782 6.1983 5.9661 12.5873 1.0816 1.0914 1.0870 1.0868 1.0879 1.0917 1.0928 1.0961 1.1016 1.0999
irintensity: 0.1475 2.7066 0.2148 3.5148 2.9680 4.1465 0.8280 0.4695 0.3500 1.7058 0.7995 0.1645 1.4515 5.1548 4.2423 2.4157 0.1098 8.8747 10.9978 49.0887 40.4265 54.0648 21.2056 7.7465 7.2284 0.0057 2.7880 2.2106 1.0395 3.2992 0.0842 1.1306 0.4735 0.2336 10.8950 6.9436 1.3948 5.3574 7.6480 0.0230 0.3608 0.4621 1.0592 3.5246 0.4875 2.9847 2.1496 0.6867 4.4441 0.2175 27.6427 12.7841 17.7489 22.8283 5.5665 0.3624 1.4379 8.6784 8.1027 4.6704 21.5907 4.7032 0.0135 1.5600 9.4887 16.2222 25.8705 21.7981 18.7522
temp: 298.150 k
press: 1.00000 atm
elementType: 7 7 6 6 6 6 6 6 6 6 6 6 6 6 6 1 1 1 1 1 1 1 1 1 1
symmnumber: 1
zpe: 504913.4 jmol-1
zpe.correction: 0.192311 hartree
zpe.thermalcorrener: 0.204615 hartree
zpe.thermalcorrenthalpy: 0.205559 hartree
zpe.thermalcorrgfe: 0.150369 hartree
zpe.sumelectzpe: -609.832784 hartree
zpe.sumelectthermal: -609.820480 hartree
zpe.sumelectthermalent: -609.819536 hartree
zpe.sumelectthermalfe: -609.874726 hartree
dipole: -1.9135 -3.1897 1.1140
dipole: 3.8829
quadrupole: -85.8375 -100.0803 -81.2110
quadrupole: 2.0439 4.4363 -1.9266
quadrupole: 3.2054 -11.0374 7.8319 2.0439 4.4363 -1.9266
hfenergy: -610.0250954 hartree
pointgroup: C01 [X(C13H10N2)]
dipole: 0.7848648 -1.2675528 -0.3331619 debye
dipolederiv: -0.3950213 -0.0816151 -0.0131669 -0.1108563 -0.2636546 -0.023667 -0.0057251 -0.0198064 -0.327042 -0.2026601 0.0249831 0.0068805 -0.0171713 -0.3079921 -0.0464104 0.0181783 0.0432551 -0.1994651 0.1241379 -0.0225882 0.0310957 -0.0068113 0.1864324 0.0758852 0.1252811 0.1036074 0.2357139 0.2514201 -0.199453 -0.0326632 -0.2583158 -0.0209589 0.0049353 -0.1457616 0.0338492 -0.0298348 0.20119 0.1697934 0.0817834 0.21709 0.0003307 0.02489 0.0274137 0.0110404 -0.1862119 -0.118152 0.0977868 -0.0853597 0.068485 -0.0848862 -0.0474587 -0.048905 -0.0797751 -0.0794844 -0.1917445 -0.007484 -0.0082577 0.0459129 0.0061182 -0.060765 -0.0189859 -0.0577011 -0.1032116 -0.0242944 0.0416691 -0.0520399 0.0370937 -0.0624661 -0.0060664 -0.0390402 0.0134683 0.0756732 0.0377105 0.0578467 -0.0662219 0.0743819 -0.0380278 0.0222249 0.0001253 0.0734293 0.2941545 -0.0536339 -0.0381549 -0.0275335 -0.0549482 0.0760548 -0.0988738 -0.0254551 -0.0883005 -0.0726258 0.0192398 0.0327564 -0.1228971 0.0563828 -0.0356916 -0.0773959 -0.1060956 -0.0725949 -0.0264688 0.0134808 -0.0963571 -0.0714854 -0.0904392 -0.0471665 -0.0044602 -0.0522406 -0.0028617 -0.1122926 -0.1494071 -0.0426479 -0.0227272 -0.0112605 0.1586021 -0.0389126 -0.0309982 -0.1457905 -0.0293908 -0.1893558 -0.0582409 0.0241506 -0.0411836 -0.103027 0.0346803 0.1211986 0.081914 0.0708096 0.2565776 0.2120174 0.0767593 0.1869859 0.0483162 0.0707008 -0.0462861 -0.0080762 0.1071612 0.0536661 0.0452501 0.0525311 0.0432984 0.0112176 0.0173563 -0.0044569 -0.0335183 -0.0400922 0.0243097 -0.0447824 0.1151241 -0.0546572 0.0762117 0.0341803 0.114752 0.0519999 0.0639354 0.1327047 0.029626 0.0048807 0.029754 -0.0172956 0.0668106 -0.0048587 0.0725146 0.1059225 0.0620381 -0.0474408 0.0853871 -0.0402705 0.1022711 0.0340733 0.0969306 0.0226845 0.0378673 0.0803367 -0.0407113 -0.0704354 -0.0461198 0.0865851 -0.0615617 -0.0772394 -0.069627 -0.0615269 0.0815486 0.0414221 0.0139705 0.0606187 -0.067856 0.0950553 0.0078852 0.0934067 0.0948366 -0.0098351 -0.0309699 0.102075 -0.0390891 0.065709 0.0730267 0.1220315 0.066681 0.0560797 -0.0517952 0.1033174 0.0602284 0.1099932 0.0477295 0.000116 0.0663902 0.0001676 0.1249504 0.0878604 -0.0395747 -0.0277793 -0.0460531 0.1202829 -0.0481641 -0.0579799 -0.0607433 -0.0741987 -0.0403215 -0.1064486 -0.0542993 -0.1128207 0.0631611 -0.0401991 -0.0361582 -0.0292229 0.0747414 unknown
polarizability: 167.6136131|7.8279614|134.1792146|-14.3081346|-11.6907555|114.9469004 unknown
InChI: InChI=1S/C13H10N2/c14-9-13(11-5-2-1-3-6-11)12-7-4-8-15-10-12/h1-8,10,13H
charge 0 multiplicity 1
25 atoms
N  -3.325953 -0.971729 0.980855
N  -0.130707 3.408934 -0.410642
C  -0.013707 0.952082 0.633086
C  1.289094 0.208545 0.260709
C  -1.275323 0.158757 0.246409
C  1.510116 -1.075737 0.820144
C  2.259803 0.763032 -0.605671
C  -1.549107 -0.194069 -1.097591
C  -2.194644 -0.252348 1.2409
C  2.68634 -1.79344 0.518193
C  3.437085 0.040517 -0.911251
C  3.654769 -1.237444 -0.351221
C  -0.071647 2.312762 0.055934
C  -2.715201 -0.932361 -1.386593
C  -3.571614 -1.299953 -0.320958
H  -0.031962 1.077603 1.736001
H  0.75887 -1.517622 1.486037
H  2.105265 1.758668 -1.036843
H  -0.861864 0.102306 -1.897943
H  -2.0261 0.004219 2.295275
H  2.847445 -2.783837 0.957937
H  4.182654 0.479968 -1.582904
H  4.567972 -1.794726 -0.5869
H  -2.961027 -1.220323 -2.41334
H  -4.486458 -1.874306 -0.504822
