program: Gaussian 09
title: 000270968
version: EM64L-G09RevD.01
frameworkgroup: C1[X(C11H15N5O2S)]
method: RPBEPBE
basis: SDD
operation: Freq
keyword: #p
keyword: freq=noraman
keyword: PBEPBE/SDD
title: #p freq=noraman PBEPBE/SDD
converged: YES YES NO NO
title: Mulliken charges:
elementType: S O O N N N N N C C C C C C C C C C C H H H H H H H H H H H H H H H
charge: 0.269281 -0.277319 -0.304121 -0.152714 -0.046075 -0.026417 0.002480 -0.368472 0.152463 0.111674 -0.348415 -0.322537 -0.204506 -0.606191 -0.348612 -0.672952 -0.381599 0.347073 -0.606428 0.263641 0.259380 0.308772 0.273654 0.271572 0.216361 0.215300 0.213316 0.222684 0.213031 0.247339 0.336510 0.236060 0.234371 0.271395
chargesum: 0.00000
title: Mulliken charges with hydrogens summed into heavy atoms:
elementType: S O O N N N N N C C C C C C C C C C C
charge: 0.269281 -0.277319 -0.304121 -0.152714 -0.046075 -0.026417 0.002480 -0.031962 0.152463 0.111674 -0.348415 0.200484 0.104266 -0.060964 0.083049 -0.023921 -0.134260 0.347073 0.135398
polarizability: 2.79643181e+02 2.43897674e+00 1.63095876e+02 -1.01626798e+01 1.52261284e+01 1.21876742e+02
1716.lowfreq: -1.8937 -0.0011 0.0010 0.0012 1.4214 7.6135 18.1892 32.0444 39.7456
frequency: 18.1433 32.0141 39.7260 56.9408 60.5631 76.6154 78.8382 100.9793 116.9151 136.9816 144.8094 173.7488 189.7253 224.9619 226.2159 242.2625 250.4017 271.1142 335.7952 350.4696 367.1586 427.0350 502.1505 530.5255 553.7652 580.8113 599.7907 624.7889 629.6828 650.3471 661.0937 694.1300 696.9789 743.5454 744.6131 794.4150 815.2578 844.3509 856.0523 858.9771 899.6231 906.7024 920.9662 939.5406 1000.2189 1047.1037 1059.2250 1078.6075 1093.1567 1110.9787 1126.5741 1145.2574 1147.8044 1184.1956 1197.8335 1209.3952 1214.5088 1249.7958 1262.6107 1285.3908 1287.0477 1301.4096 1335.1341 1338.4288 1371.8339 1390.5606 1390.9719 1392.3546 1428.0421 1433.1952 1441.8320 1455.8896 1465.1459 1475.6738 1477.4617 1484.0836 1486.4501 1520.0029 1520.9358 1543.5892 1688.1347 2978.9889 2986.7775 2989.3667 3037.5552 3041.5075 3057.7777 3067.1401 3077.4057 3080.6003 3118.6736 3119.1842 3143.2383 3170.4467 3239.7878 3571.6801
redmass: 4.5392 4.3723 5.0340 1.7510 4.2521 5.3868 4.0507 1.2046 3.0853 5.5862 6.1477 5.7160 5.8643 2.9666 1.2142 5.0347 3.9148 5.7135 3.5786 3.7057 4.9679 14.4789 5.3623 4.1596 6.4833 6.5298 1.1501 5.2754 6.8154 6.0482 7.1765 6.1527 9.2355 1.1844 4.4629 7.8235 11.2570 3.5166 1.1852 1.5160 2.8556 3.3376 1.4387 7.9487 2.3387 2.8707 1.1789 5.8384 4.1846 2.6222 1.2840 3.0510 2.1266 3.2323 1.9975 2.0329 1.4025 1.2694 2.0691 1.1019 6.1833 5.5334 1.7848 1.4983 3.4174 1.2893 1.2060 1.6800 1.5871 1.1888 1.0864 1.7600 1.3102 1.0514 1.0418 1.0434 1.0818 1.5282 8.5643 8.1903 8.8515 1.0353 1.0352 1.0601 1.1018 1.0574 1.0587 1.1028 1.1013 1.0994 1.0988 1.1082 1.1088 1.0922 1.1000 1.0773
irintensity: 1.0075 0.9407 1.3364 0.6796 3.1100 0.0154 6.8745 1.0129 2.3316 2.3747 0.5029 0.2273 2.9684 3.1099 0.4819 1.1733 4.0162 0.7850 21.3976 21.5753 3.2578 6.3876 1.0485 1.6067 16.1178 23.0782 128.8516 10.1229 6.1539 10.8315 5.0325 2.3769 24.6131 15.9864 89.7733 3.9084 17.9412 17.9557 0.8617 13.7901 101.3578 32.3049 8.3917 264.8623 24.9473 3.2769 1.4141 349.1768 10.3512 21.1698 0.2090 73.6805 93.8874 11.3191 191.7984 133.1590 0.0152 7.5877 7.6470 0.1894 65.3848 53.7980 29.3428 31.4956 35.2602 27.4001 11.7614 39.9415 42.6579 24.8305 9.7520 70.4262 88.0239 4.2842 13.5818 17.1250 14.1590 185.2827 222.0768 65.1891 311.1903 40.2733 69.1814 19.8450 4.6264 9.9045 20.2268 32.8499 48.8608 47.4287 3.8156 23.1637 0.7936 15.5169 10.9876 46.4570
temp: 298.150 k
press: 1.00000 atm
elementType: 16 8 8 7 7 7 7 7 6 6 6 6 6 6 6 6 6 6 6 1 1 1 1 1 1 1 1 1 1 1 1 1 1 1
symmnumber: 1
zpe: 689590.2 jmol-1
zpe.correction: 0.262651 hartree
zpe.thermalcorrener: 0.282043 hartree
zpe.thermalcorrenthalpy: 0.282987 hartree
zpe.thermalcorrgfe: 0.211685 hartree
zpe.sumelectzpe: -1249.029873 hartree
zpe.sumelectthermal: -1249.010481 hartree
zpe.sumelectthermalent: -1249.009537 hartree
zpe.sumelectthermalfe: -1249.080839 hartree
dipole: 2.5930 1.1657 2.4413
dipole: 3.7473
quadrupole: -83.6394 -124.3339 -114.5243
quadrupole: -1.2815 9.5271 -6.8934
quadrupole: 23.8598 -16.8347 -7.0251 -1.2815 9.5271 -6.8934
hfenergy: -1249.2925239 hartree
pointgroup: C01 [X(C11H15N5O2S1)]
dipole: -1.0282881 -1.013128 0.2996109 debye
polarizability: 279.4927859|-6.8485399|155.6187918|9.2893261|21.9713881|129.5042214 unknown
InChI: InChI=1S/C11H15N5O2S/c1-3-4-19-10-8-9(13-5-14-10)16(6-15-8)7-18-11(17)12-2/h5-6,12H,3-4,7H2,1-2H3
charge 0 multiplicity 1
34 atoms
S  3.336976 0.866535 0.653876
O  -3.528628 -0.888161 -0.491908
O  -4.319337 1.243221 0.169555
N  -1.423912 0.259288 -0.92247
N  0.095903 1.577963 0.192447
N  0.058957 -1.627083 -1.548674
N  2.357328 -1.291848 -0.760484
N  -5.040228 -0.748595 1.201913
C  -0.204598 -0.430884 -0.960661
C  0.726291 0.403537 -0.268292
C  2.056769 -0.087439 -0.188091
C  -2.678746 -0.20805 -1.488717
C  -1.177335 1.456638 -0.213595
C  4.833282 -0.28434 0.418738
C  6.069086 0.378908 1.04887
C  7.316469 -0.523018 0.901735
C  1.367434 -1.989374 -1.402562
C  -4.3178 -0.008604 0.306709
C  -5.957673 -0.133498 2.166707
H  -2.456606 -0.985082 -2.233624
H  -3.231725 0.644591 -1.914827
H  -1.978662 2.167083 -0.021452
H  4.951503 -0.45198 -0.663559
H  4.585623 -1.24673 0.894401
H  6.257618 1.356997 0.565667
H  5.881762 0.581289 2.1212
H  7.543306 -0.72086 -0.162321
H  8.202759 -0.0422 1.353472
H  7.166171 -1.497155 1.40304
H  1.663295 -2.943828 -1.846698
H  -4.913837 -1.761267 1.180752
H  -5.654409 -0.361414 3.204594
H  -6.994269 -0.482975 2.009144
H  -5.926667 0.957536 2.020817
