program: Gaussian 09
title: 000270946
version: EM64L-G09RevD.01
frameworkgroup: C1[X(C11H11ClN4O2S)]
method: RPBEPBE
basis: SDD
operation: Freq
keyword: #p
keyword: freq=noraman
keyword: PBEPBE/SDD
title: #p freq=noraman PBEPBE/SDD
converged: YES YES NO NO
title: Mulliken charges:
elementType: Cl S O O N N N N C C C C C C C C C C C H H H H H H H H H H H
charge: -0.034503 0.218505 -0.178647 -0.221697 0.031891 -0.375855 -0.191953 0.039526 -0.312255 0.360937 0.459179 -0.471995 -0.182215 -0.328386 -0.342402 -0.333552 0.306625 -0.809752 -0.569042 0.250803 0.262047 0.236410 0.278490 0.273545 0.363699 0.235188 0.234038 0.226175 0.278300 0.296896
chargesum: 0.00000
title: Mulliken charges with hydrogens summed into heavy atoms:
elementType: Cl S O O N N N N C C C C C C C C C C C
charge: -0.034503 0.218505 -0.178647 -0.221697 0.031891 -0.012156 -0.191953 0.039526 -0.312255 0.360937 0.459179 -0.221192 -0.182215 -0.066339 -0.105992 0.218483 0.306625 -0.114352 0.006154
polarizability: 3.45780348e+02 1.92209208e+01 1.90102294e+02 -9.14940449e+00 9.58482994e+00 8.43267949e+01
1716.lowfreq: -4.0758 -1.3752 0.0016 0.0016 0.0017 4.1109 10.4118 26.1442 28.2775
frequency: 9.8888 26.0659 28.2170 38.0385 54.5718 59.0085 75.0223 113.9433 134.6576 170.9975 184.5923 186.8522 220.0614 231.8766 261.7011 300.3176 329.8341 369.6690 377.1804 392.1802 433.3209 437.0414 455.2262 493.3822 504.5842 551.1990 585.9384 589.9981 646.5875 682.6697 685.4174 703.1184 737.3546 752.1656 772.7658 778.9407 804.1790 830.7369 850.9975 873.5583 892.0004 940.4657 967.3716 994.2813 1019.5300 1043.2986 1045.8659 1049.7302 1055.6836 1123.6838 1147.4905 1206.9840 1213.0003 1239.9188 1256.8448 1269.9508 1286.8056 1322.7789 1358.4942 1362.3552 1383.2617 1399.3383 1410.3392 1439.0162 1455.2295 1456.8577 1468.9926 1479.8503 1505.8897 1559.2550 1586.4286 1624.8545 1677.8207 2978.4203 3045.6812 3056.5133 3070.2059 3087.3949 3118.9724 3133.5950 3149.0406 3159.3509 3173.2233 3418.7635
redmass: 7.3426 6.9847 9.2327 1.0541 3.4613 5.0404 6.2379 6.3112 6.0962 9.9197 6.0665 7.3805 5.0444 5.8088 8.3224 4.7674 3.1349 7.3142 5.6807 5.4282 5.2416 4.0451 11.3381 8.3368 7.6070 6.0908 8.3475 4.4209 6.8992 5.3481 6.5278 5.9979 4.1636 1.8406 1.2925 2.9983 5.0499 1.3989 4.9301 1.3450 3.4186 4.4538 1.3412 1.4929 4.7823 2.7690 1.5539 1.6191 4.8475 1.6596 2.1440 2.0393 1.9476 3.1839 2.3975 1.1711 2.1660 1.1978 1.2963 3.9612 7.0063 1.2479 4.1215 1.1298 2.4566 1.0936 1.0464 1.2790 1.7611 6.1188 8.0197 7.6822 9.3468 1.0374 1.0591 1.0976 1.0559 1.0988 1.1051 1.0897 1.0925 1.1129 1.0957 1.0773
irintensity: 0.0376 0.0930 0.2902 0.3935 0.3085 0.2383 2.0943 8.8434 3.0214 12.0544 3.7640 1.0910 0.7801 2.6313 2.6366 1.5889 4.7736 22.3282 11.8417 0.2369 10.5999 2.5432 2.3455 7.1230 5.9578 2.5674 58.3609 4.4447 30.2188 7.0286 2.0764 69.6130 0.7939 27.2202 97.4816 62.7668 69.7004 57.0435 46.4442 3.8078 86.3606 35.5838 1.4243 5.9097 127.9090 26.1875 12.3612 7.7100 28.9207 25.0108 66.9256 19.9331 0.3398 69.2485 3.8010 4.1843 5.8166 33.9283 22.4367 4.3768 210.8071 8.9288 6.2814 26.0110 31.0212 9.7083 13.6421 16.7972 1068.6413 42.6114 64.9039 162.8431 229.4369 38.7261 1.5835 18.5789 12.1768 18.0326 1.3037 16.0931 8.6659 2.4557 5.3972 136.2704
temp: 298.150 k
press: 1.00000 atm
elementType: 17 16 8 8 7 7 7 7 6 6 6 6 6 6 6 6 6 6 6 1 1 1 1 1 1 1 1 1 1 1
symmnumber: 1
zpe: 558468.8 jmol-1
zpe.correction: 0.212710 hartree
zpe.thermalcorrener: 0.231443 hartree
zpe.thermalcorrenthalpy: 0.232387 hartree
zpe.thermalcorrgfe: 0.160903 hartree
zpe.sumelectzpe: -1651.924916 hartree
zpe.sumelectthermal: -1651.906182 hartree
zpe.sumelectthermalent: -1651.905238 hartree
zpe.sumelectthermalfe: -1651.976723 hartree
dipole: -4.0620 1.1996 0.4329
dipole: 4.2575
quadrupole: -115.2298 -130.9005 -124.6766
quadrupole: 2.4756 -1.3664 -1.0793
quadrupole: 8.3725 -7.2982 -1.0743 2.4756 -1.3664 -1.0793
hfenergy: -1652.1376256 hartree
pointgroup: C01 [X(C11H11Cl1N4O2S1)]
dipole: 1.5558071 -0.6056217 0.1356113 debye
polarizability: 347.7946421|6.2550661|188.9311139|9.3033427|-3.6761743|83.4836812 unknown
InChI: InChI=1S/C11H11ClN4O2S/c1-7-2-3-8-9(6-7)19-10(13-8)14-11(17)16(15-18)5-4-12/h2-3,6,14H,4-5H2,1H3
charge 0 multiplicity 1
30 atoms
Cl -6.570166 2.039989 0.43981
S  1.507892 -1.965315 0.034558
O  -1.88916 1.46484 -0.434129
O  -4.534593 -2.293438 -0.107536
N  0.985759 0.698946 -0.072375
N  -0.984683 -0.717224 -0.130788
N  -3.315724 -0.39692 -0.309932
N  -3.366446 -1.787441 -0.117966
C  2.882707 -0.778479 0.068591
C  2.386161 0.564567 -0.000186
C  5.177889 0.022724 0.158482
C  4.259432 -1.056981 0.148084
C  0.386106 -0.462601 -0.066605
C  3.306441 1.638335 0.011808
C  4.682434 1.359054 0.090405
C  -4.521175 0.434907 -0.525056
C  -1.993804 0.22812 -0.300091
C  6.67273 -0.233034 0.237865
C  -5.022304 1.033469 0.80074
H  4.628008 -2.086367 0.200176
H  2.9279 2.663084 -0.040538
H  5.398266 2.189366 0.099595
H  -4.255509 1.241611 -1.22541
H  -5.294015 -0.216502 -0.966936
H  -1.316517 -1.688432 -0.047515
H  7.192836 0.15723 -0.657198
H  7.118526 0.269599 1.116487
H  6.899673 -1.309836 0.314987
H  -5.323196 0.261695 1.523561
H  -4.296269 1.734734 1.235216
