program: Gaussian 09
title: 000274923
version: EM64L-G09RevD.01
frameworkgroup: C1[X(C13H12N4)]
method: RPBEPBE
basis: SDD
operation: Freq
keyword: #pfreq=noraman
keyword: PBEPBE/SDD
title: #p freq=noraman PBEPBE/SDD
converged: YES YES NO NO
title: Mulliken charges:
elementType: N N N N C C C C C C C C C C C C C H H H H H H H H H H H H
charge: 0.055298 -0.708977 -0.709707 -0.573903 0.239499 0.224793 0.258710 0.300074 -0.362771 -0.395380 -0.420456 -0.674489 -0.589184 0.554610 0.525593 -0.455668 -0.454798 0.234187 0.240817 0.264270 0.188917 0.211184 0.215410 0.299842 0.303275 0.297962 0.304240 0.304361 0.322291
chargesum: 0.00000
title: Mulliken charges with hydrogens summed into heavy atoms:
elementType: N N N N C C C C C C C C C C C C C
charge: 0.055298 -0.105860 -0.107506 0.052749 0.239499 0.224793 0.258710 0.300074 -0.362771 -0.161193 -0.179639 -0.410219 -0.400267 0.554610 0.525593 -0.244484 -0.239388
polarizability: 3.17316835e+02 3.76445597e+00 2.14126948e+02 3.50193394e-02 -7.77283385e-02 6.61698739e+01
1716.lowfreq: -2.8007 -1.9316 -0.0006 -0.0004 0.0001 7.7148 20.4326 81.6198 118.7036
frequency: 19.6493 81.6147 118.7027 153.3717 165.6400 175.8839 216.2341 258.1938 301.8454 314.4744 317.2499 323.2071 324.7170 349.4539 358.1764 371.3481 391.4892 403.4728 413.1656 460.0609 465.5239 521.7470 543.2901 555.4625 561.3498 615.3139 654.4933 681.0989 684.9737 728.4708 761.0314 783.0444 804.3426 808.2334 824.2465 835.5788 896.0786 900.2122 935.6400 941.6419 975.0421 999.0651 1029.7008 1036.8865 1055.3661 1130.9630 1136.5164 1173.8015 1181.5639 1221.9475 1248.4692 1269.7391 1304.8032 1316.2527 1339.1747 1377.9891 1395.8215 1457.0444 1468.1652 1482.1779 1500.3367 1575.0068 1585.0900 1598.4983 1627.8007 1634.1374 1639.7881 1642.3449 1646.1710 3112.5516 3113.4909 3116.3305 3134.0795 3138.3348 3141.5854 3491.7317 3569.2541 3570.9421 3679.1122 3711.1511 3711.4578
redmass: 3.0046 4.3758 3.8318 4.6893 3.7689 4.3157 2.0738 3.5096 1.2413 4.6586 1.2636 3.4019 1.3179 1.8699 1.0628 4.2274 4.4284 1.9157 3.5071 3.0472 2.2732 6.2959 5.4449 4.5130 1.8118 2.9520 6.3422 3.2420 5.8470 5.8296 2.0736 2.7022 5.7448 1.4851 1.8887 2.8718 1.8573 4.1403 1.3844 1.4322 3.5054 2.5394 1.5280 2.4300 1.9205 1.5551 1.4405 2.1615 2.4740 1.5116 2.1234 1.7665 1.6704 2.2961 4.0436 7.3846 3.3711 4.7045 3.6051 4.9466 4.6807 7.9526 7.2248 6.1253 4.1428 1.7875 1.3813 1.7762 1.2729 1.0866 1.0897 1.0872 1.0931 1.0954 1.0963 1.0440 1.0445 1.0448 1.1020 1.1041 1.1040
irintensity: 4.4681 22.9480 0.1440 5.4588 3.5895 3.3474 32.3596 8.8871 184.4905 4.7868 335.3477 2.6515 9.6815 182.8036 3.9804 1.7577 2.6989 130.9882 0.2024 0.5365 10.6278 12.2503 3.7252 0.0824 31.1335 0.0595 1.9074 10.9228 3.5316 0.5209 17.7014 5.2773 30.5711 73.1543 14.9905 35.6794 47.0326 8.9287 0.2487 0.2091 0.5130 0.2998 0.5491 33.4479 9.3441 8.6111 40.5321 102.6158 15.8670 14.1465 32.4631 76.8597 5.6160 58.3610 10.5874 35.9055 2.3152 3.1963 118.5297 239.1061 38.9562 193.5406 27.1763 2.5974 39.2509 2.7864 443.5887 30.1918 198.3657 28.6740 30.3928 22.4085 17.7336 23.3373 31.6986 25.7346 134.4050 57.8553 62.0507 17.6071 18.1197
temp: 298.150 k
press: 1.00000 atm
elementType: 7 7 7 7 6 6 6 6 6 6 6 6 6 6 6 6 6 1 1 1 1 1 1 1 1 1 1 1 1
symmnumber: 1
zpe: 595497.5 jmol-1
zpe.correction: 0.226813 hartree
zpe.thermalcorrener: 0.241813 hartree
zpe.thermalcorrenthalpy: 0.242757 hartree
zpe.thermalcorrgfe: 0.185330 hartree
zpe.sumelectzpe: -720.409544 hartree
zpe.sumelectthermal: -720.394544 hartree
zpe.sumelectthermalent: -720.393600 hartree
zpe.sumelectthermalfe: -720.451027 hartree
dipole: 2.1391 1.6350 0.0240
dipole: 2.6925
quadrupole: -55.2440 -78.7057 -108.9845
quadrupole: 4.9173 -0.0226 0.1071
quadrupole: 25.7341 2.2724 -28.0065 4.9173 -0.0226 0.1071
hfenergy: -720.6363569 hartree
pointgroup: C01 [X(C13H12N4)]
dipole: 0.8549344 0.6250778 0.0221098 debye
polarizability: 317.4150404|1.5555337|214.0006786|1.9561488|1.3919748|66.1979384 unknown
InChI: InChI=1S/C13H12N4/c14-7-1-3-9-10-4-2-8(15)6-12(10)13(17-16)11(9)5-7/h1-6H,14-16H2
charge 0 multiplicity 1
29 atoms
N  -0.071897 2.657685 0.047034
N  -4.919241 0.268553 -0.018885
N  4.842159 -0.368251 0.047294
N  1.03285 3.45263 0.06985
C  -0.832864 -0.875112 0.007345
C  0.635835 -0.953331 0.018719
C  -1.207229 0.50472 0.013929
C  1.178656 0.380806 0.032564
C  0.026861 1.331789 0.032052
C  -1.837677 -1.863465 -0.007852
C  1.503627 -2.062217 0.016301
C  -2.551392 0.904123 0.005752
C  2.577426 0.575587 0.041144
C  -3.567544 -0.096919 -0.009874
C  3.453309 -0.552465 0.03868
C  -3.195773 -1.477061 -0.016492
C  2.901393 -1.866599 0.026923
H  -1.580781 -2.929175 -0.013041
H  1.102779 -3.082081 0.005921
H  -2.809708 1.968868 0.011391
H  3.041124 1.569145 0.046262
H  -3.981668 -2.242685 -0.028413
H  3.57634 -2.731496 0.025204
H  -5.649123 -0.436916 -0.02905
H  -5.191899 1.246428 -0.013595
H  5.248055 0.56213 0.054226
H  5.469532 -1.16625 0.04282
H  1.993061 3.106559 0.088401
H  0.852387 4.451001 0.084395
