program: Gaussian 09
title: 000274922
version: EM64L-G09RevD.01
frameworkgroup: C1[X(C13H12N4)]
method: RPBEPBE
basis: SDD
operation: Freq
keyword: #pfreq=noraman
keyword: PBEPBE/SDD
title: #p freq=noraman PBEPBE/SDD
converged: YES YES NO NO
title: Mulliken charges:
elementType: N N N N C C C C C C C C C C C C C H H H H H H H H H H H H
charge: 0.044498 -0.706031 -0.707315 -0.579130 0.278622 0.168282 0.280002 0.242889 -0.322023 -0.663246 -0.369956 -0.681091 -0.329629 0.571434 0.559073 -0.461841 -0.517056 0.234144 0.232429 0.266730 0.195599 0.212309 0.212943 0.304559 0.305174 0.301352 0.305587 0.302490 0.319205
chargesum: 0.00000
title: Mulliken charges with hydrogens summed into heavy atoms:
elementType: N N N N C C C C C C C C C C C C C
charge: 0.044498 -0.096299 -0.100376 0.042565 0.278622 0.168282 0.280002 0.242889 -0.322023 -0.429102 -0.137527 -0.414361 -0.134031 0.571434 0.559073 -0.249533 -0.304113
polarizability: 3.08324524e+02 -3.21040240e+00 2.32427077e+02 1.22075129e-02 -4.62103912e-02 6.62489191e+01
1716.lowfreq: -6.9599 -2.0511 0.0002 0.0003 0.0007 4.3961 51.2311 74.1436 118.2350
frequency: 51.2298 74.1388 118.2341 148.6887 168.2385 178.0748 237.6826 270.7807 306.9795 325.7669 332.7889 345.1606 345.5111 356.3774 366.6120 374.0454 375.4026 397.6235 426.2766 455.4824 475.5388 496.1533 549.5908 576.4228 578.5468 632.8945 656.9744 669.1460 678.0309 727.9274 767.3940 783.4889 794.6846 813.5030 823.4076 880.8716 888.5972 895.8033 899.7969 936.2132 964.3976 1010.2103 1027.6660 1034.3035 1054.2294 1133.3224 1144.3324 1170.7579 1211.1101 1217.5178 1247.6822 1263.9481 1283.8899 1328.1649 1343.8399 1387.0884 1403.6398 1449.4482 1469.2600 1495.6937 1508.1734 1571.0619 1581.9601 1592.4708 1631.0792 1634.7123 1639.4246 1642.3932 1645.3694 3112.6684 3112.9049 3116.7735 3135.0018 3137.7348 3139.5046 3493.1230 3566.0170 3567.5126 3682.2643 3707.3473 3709.4393
redmass: 3.1397 4.7644 3.9124 4.6880 3.7562 4.3540 1.9748 3.8297 3.7759 2.0905 1.4745 2.8123 4.0544 1.2991 1.0412 4.2397 1.0618 3.7653 2.2359 2.6252 1.8704 5.1967 4.3203 6.8188 2.8909 2.7149 5.1055 3.0198 6.7060 5.9973 2.0207 2.4497 2.2937 1.7068 5.7113 1.8326 5.3267 1.8370 1.5609 1.4168 2.9139 2.0617 2.1823 1.5105 2.4738 1.5224 1.6771 2.1351 2.0138 1.6800 2.0813 1.8000 1.9509 2.1485 2.6812 6.4983 4.3878 3.6913 4.5261 4.7263 4.7893 7.5175 6.6337 6.9960 5.4323 1.8550 1.2811 1.3546 1.6059 1.0860 1.0869 1.0909 1.0940 1.0960 1.0948 1.0442 1.0447 1.0446 1.1018 1.1040 1.1041
irintensity: 5.1347 15.0495 4.4258 4.8094 5.8294 4.2550 40.6704 5.4912 1.6561 158.4281 90.6961 45.1709 6.0251 467.0081 11.9345 1.4534 31.1599 3.6965 60.6308 1.5122 0.3621 2.5225 5.2850 3.6558 3.0930 19.6013 14.5232 2.3483 3.7853 1.5691 32.6224 0.7585 14.6539 77.7237 11.5377 9.9661 15.1030 55.3964 5.0414 0.0503 1.9147 1.0773 3.3622 2.8287 48.7679 38.3928 34.5305 123.5341 24.7951 29.9095 119.9874 4.4326 9.6584 43.5984 13.5339 80.2416 8.3467 11.9542 82.8939 47.2484 104.9705 35.6296 188.6181 44.0469 431.7248 1.0806 471.7634 37.8108 90.5734 18.4912 14.9408 19.2243 24.3157 48.6482 9.7762 29.8171 114.4756 87.5625 61.5807 18.9646 18.7365
temp: 298.150 k
press: 1.00000 atm
elementType: 7 7 7 7 6 6 6 6 6 6 6 6 6 6 6 6 6 1 1 1 1 1 1 1 1 1 1 1 1
symmnumber: 1
zpe: 596622.7 jmol-1
zpe.correction: 0.227242 hartree
zpe.thermalcorrener: 0.242027 hartree
zpe.thermalcorrenthalpy: 0.242971 hartree
zpe.thermalcorrgfe: 0.186649 hartree
zpe.sumelectzpe: -720.412774 hartree
zpe.sumelectthermal: -720.397989 hartree
zpe.sumelectthermalent: -720.397044 hartree
zpe.sumelectthermalfe: -720.453366 hartree
dipole: 1.3255 -0.3974 0.0048
dipole: 1.3838
quadrupole: -59.5714 -73.4054 -109.0172
quadrupole: -0.2103 -0.0855 0.1466
quadrupole: 21.0933 7.2593 -28.3525 -0.2103 -0.0855 0.1466
hfenergy: -720.6400152 hartree
pointgroup: C01 [X(C13H12N4)]
dipole: 0.5120416 -0.1849385 0.0026502 debye
polarizability: 307.7271582|-7.3965926|232.9711106|1.661482|2.5907854|66.3022513 unknown
InChI: InChI=1S/C13H12N4/c14-7-2-4-10-11(5-7)9-3-1-8(15)6-12(9)13(10)17-16/h1-6H,14-16H2
charge 0 multiplicity 1
29 atoms
N  -0.439066 2.792062 0.0645
N  4.204512 -2.221048 0.019141
N  -4.853934 -0.320593 -0.020558
N  0.544765 3.737076 0.089147
C  0.818444 -0.670742 0.018746
C  -0.64465 -0.818058 0.005463
C  -1.226117 0.489055 0.020928
C  1.14184 0.736541 0.041162
C  -0.135522 1.496449 0.044678
C  1.821719 -1.652468 0.011307
C  -1.48407 -1.95064 -0.018783
C  -2.615846 0.674739 0.013037
C  2.505336 1.112827 0.054387
C  3.192623 -1.257965 0.025573
C  -3.463611 -0.471881 -0.011544
C  -2.884017 -1.780094 -0.027314
C  3.519816 0.130879 0.046661
H  1.562483 -2.718297 -0.005543
H  -1.064978 -2.96363 -0.031184
H  -3.035353 1.686598 0.025438
H  2.830321 2.159267 0.069621
H  -3.542577 -2.657418 -0.046425
H  4.573336 0.435609 0.056878
H  5.182804 -1.949033 0.02377
H  3.979401 -3.211059 -0.002748
H  -5.466449 -1.130161 -0.036266
H  -5.274057 0.603749 -0.010541
H  1.543852 3.527493 0.103154
H  0.227295 4.700345 0.107218
