program: Gaussian 09
title: 000274919
version: EM64L-G09RevD.01
frameworkgroup: C1[X(C13H11N3)]
method: RPBEPBE
basis: SDD
operation: Freq
keyword: #pfreq=noraman
keyword: PBEPBE/SDD
title: #p freq=noraman PBEPBE/SDD
converged: YES YES NO NO
title: Mulliken charges:
elementType: N N N C C C C C C C C C C C C C H H H H H H H H H H H
charge: 0.052599 -0.706263 -0.575363 0.256382 0.168747 0.246741 0.266457 -0.311323 -0.619308 -0.438526 -0.403012 -0.365079 0.546513 -0.448591 -0.240158 -0.278850 0.232144 0.269037 0.243844 0.203309 0.215489 0.226474 0.224310 0.303979 0.303096 0.303380 0.323973
chargesum: 0.00000
title: Mulliken charges with hydrogens summed into heavy atoms:
elementType: N N N C C C C C C C C C C C C C
charge: 0.052599 -0.099188 0.051990 0.256382 0.168747 0.246741 0.266457 -0.311323 -0.387165 -0.169489 -0.159168 -0.161770 0.546513 -0.233102 -0.013684 -0.054541
polarizability: 2.73963219e+02 -1.07182564e+01 2.17432968e+02 -5.32656237e-03 -2.02611465e-02 6.19224169e+01
1716.lowfreq: -7.2440 -0.0005 -0.0002 0.0004 3.7322 6.2218 57.9992 89.6275 125.9366
frequency: 57.9948 89.6274 125.9349 161.3921 198.9070 201.3543 238.0676 306.4295 337.8281 345.3998 355.6495 364.1910 379.8974 402.4956 418.0066 436.6641 467.3574 502.3894 540.3218 540.5806 610.5359 619.3107 633.0018 656.4716 708.2163 729.2912 737.8710 783.1008 793.6769 828.5416 858.1869 878.2898 879.5126 922.3116 930.9893 961.5456 977.6999 1002.6130 1025.1628 1038.7934 1055.5549 1117.6630 1132.4716 1174.1803 1179.1969 1211.8517 1222.6936 1253.1684 1277.4302 1313.5010 1340.9598 1386.6424 1404.2652 1436.4768 1447.7561 1484.3190 1502.6330 1572.1645 1583.4255 1591.2160 1611.8814 1634.4041 1641.6275 1645.9901 3116.2426 3120.3922 3121.0123 3127.7974 3141.4425 3158.2155 3161.3175 3489.6070 3568.0171 3678.6171 3709.2378
redmass: 3.1785 4.6602 3.9180 4.5917 4.3321 2.5839 3.7134 2.3433 1.2499 4.2910 3.6120 1.0425 2.2199 5.7287 2.4814 3.6764 2.4297 5.3898 4.7633 1.7084 6.0458 3.4388 6.3045 2.9480 5.4441 6.2586 1.4607 2.4355 2.4135 1.7535 1.5908 4.6115 2.1530 5.9258 1.4556 1.3967 1.3401 2.6849 2.1139 1.8085 3.1612 1.7712 1.5078 1.2269 1.9333 1.8114 2.3126 1.7016 1.9191 1.6976 3.1043 6.8825 4.2960 2.6929 2.7151 4.6424 4.3010 8.1574 6.1597 7.4787 7.2049 2.6231 1.5771 1.1538 1.0910 1.0856 1.0881 1.0889 1.0942 1.0953 1.1002 1.0443 1.0447 1.1017 1.1040
irintensity: 10.5109 5.0430 2.3208 6.5619 4.1423 20.9241 12.2840 74.7116 248.1324 4.1731 1.1877 7.8482 172.8729 2.1405 64.0394 1.1854 0.1098 2.6679 5.0412 4.7878 2.3066 7.4810 7.2277 25.0458 11.6319 3.3638 89.1562 2.1835 4.5346 71.6181 4.6395 3.3355 24.6991 9.2344 2.5473 1.1611 0.2523 5.3718 4.8971 4.8465 50.0029 9.4950 54.4149 13.4521 117.4109 3.7466 19.6880 16.6938 31.1517 4.7655 57.0257 45.0290 8.3045 10.4932 30.7532 9.1368 118.5995 110.5334 40.0458 28.3140 19.6827 35.7031 406.9670 4.9361 12.3541 5.1885 32.1453 3.1211 38.1381 17.8766 32.2167 36.9735 96.7735 68.7436 18.9670
temp: 298.150 k
press: 1.00000 atm
elementType: 7 7 7 6 6 6 6 6 6 6 6 6 6 6 6 6 1 1 1 1 1 1 1 1 1 1 1
symmnumber: 1
zpe: 554223.8 jmol-1
zpe.correction: 0.211093 hartree
zpe.thermalcorrener: 0.224186 hartree
zpe.thermalcorrenthalpy: 0.225131 hartree
zpe.thermalcorrgfe: 0.172229 hartree
zpe.sumelectzpe: -665.134540 hartree
zpe.sumelectthermal: -665.121447 hartree
zpe.sumelectthermalent: -665.120502 hartree
zpe.sumelectthermalfe: -665.173404 hartree
dipole: 0.1309 -0.6519 0.0055
dipole: 0.6649
quadrupole: -59.5171 -77.4038 -101.6875
quadrupole: -11.2589 0.0017 0.0007
quadrupole: 20.0190 2.1323 -22.1513 -11.2589 0.0017 0.0007
hfenergy: -665.345633 hartree
pointgroup: C01 [X(C13H11N3)]
dipole: 0.0354758 -0.2591488 0.0048493 debye
polarizability: 272.3908886|-14.1058059|218.9592431|2.665648|-1.5641042|61.9684724 unknown
InChI: InChI=1S/C13H11N3/c14-8-5-6-11-12(7-8)9-3-1-2-4-10(9)13(11)16-15/h1-7H,14-15H2
charge 0 multiplicity 1
27 atoms
N  -0.908332 2.686028 -0.060132
N  4.397571 -1.245367 0.038984
N  -2.183747 3.163342 -0.076932
C  0.742765 -0.535404 -0.011613
C  -0.660005 -0.989901 -0.024385
C  0.740807 0.892744 -0.026046
C  -1.523281 0.164591 -0.045754
C  -0.655559 1.378824 -0.046682
C  1.945596 -1.263868 0.010058
C  1.961109 1.59691 -0.018535
C  -1.194998 -2.292454 -0.019231
C  -2.925533 -0.022925 -0.063134
C  3.18204 -0.553838 0.017602
C  3.172696 0.877617 0.003084
C  -2.600158 -2.463622 -0.035839
C  -3.456983 -1.336775 -0.057981
H  1.945085 -2.360863 0.020895
H  1.963287 2.691198 -0.029319
H  -0.534776 -3.166938 -0.002678
H  -3.635905 0.810354 -0.082273
H  4.128148 1.417028 0.009063
H  -3.028877 -3.471938 -0.031826
H  -4.543141 -1.480424 -0.07154
H  5.28033 -0.743783 0.044216
H  4.419652 -2.260412 0.050256
H  -3.021338 2.579243 -0.079811
H  -2.270952 4.174233 -0.086243
