program: Gaussian 09
title: 000274896
version: EM64L-G09RevD.01
frameworkgroup: C1[X(C6H12N2O3S)]
method: RPBEPBE
basis: SDD
operation: Freq
keyword: #p
keyword: freq=noraman
keyword: PBEPBE/SDD
title: #p freq=noraman PBEPBE/SDD
converged: YES YES NO NO
title: Mulliken charges:
elementType: S O O O N N C C C C C C H H H H H H H H H H H H
charge: 0.944630 -0.578654 -0.548793 -0.328043 -0.417490 -0.407399 -0.140210 -0.625850 -0.393772 -0.576742 0.310767 -0.605699 0.314060 0.275732 0.312666 0.228594 0.284965 0.302556 0.284004 0.335729 0.303807 0.223139 0.277157 0.224846
chargesum: 0.00000
title: Mulliken charges with hydrogens summed into heavy atoms:
elementType: S O O O N N C C C C C C
charge: 0.944630 -0.578654 -0.548793 -0.328043 -0.081760 -0.103592 0.173850 -0.037453 0.119787 0.009819 0.310767 0.119443
polarizability: 1.47338851e+02 -3.25093448e+00 1.06581720e+02 3.16214269e+00 -7.17884623e-01 8.60058379e+01
1716.lowfreq: -11.0261 0.0005 0.0023 0.0024 5.2292 15.8439 39.0545 72.3698 76.7266
frequency: 38.9709 72.3632 76.6971 109.9928 123.4580 148.1759 172.5741 193.1593 231.3064 266.4913 284.5631 296.1447 340.3045 381.4874 450.7964 466.3601 481.5958 527.5361 543.4901 667.3661 688.4713 717.3600 735.4119 774.2898 797.4910 839.2258 883.6722 911.0634 935.7072 950.1243 992.7843 1011.7051 1058.9021 1097.5557 1126.3709 1129.7865 1133.8543 1139.4570 1188.0504 1201.1351 1231.0009 1255.0863 1277.8880 1299.4602 1336.6968 1406.5834 1422.8858 1429.7907 1455.3187 1464.9668 1487.6757 1500.0293 1533.7011 1627.4414 2973.9989 3016.8086 3046.8579 3050.1756 3068.4983 3070.6796 3090.4956 3109.4935 3166.4414 3172.7423 3379.9526 3559.9346
redmass: 4.5526 3.8738 6.2141 2.9283 1.2055 3.3062 6.0918 5.1479 3.7256 6.6839 5.3839 4.6194 2.4630 3.4663 5.0832 1.4554 2.4626 7.3534 5.2779 2.3480 1.8425 3.5032 2.5120 11.4135 1.9559 2.7531 2.6337 2.7152 2.7166 1.9565 2.1289 1.9824 1.7638 1.1395 1.3016 1.5712 1.6165 1.7453 1.4187 2.0791 1.2789 1.7531 1.3209 1.6515 1.3033 1.1133 1.1803 1.0946 1.1105 1.2643 1.0497 1.4395 1.8495 4.1969 1.0355 1.0612 1.0836 1.1027 1.0563 1.0582 1.1034 1.0974 1.1124 1.1127 1.0808 1.0775
irintensity: 2.9181 15.7428 16.8270 2.5257 0.9172 2.8449 0.7810 2.5548 2.7726 13.5564 14.1651 22.2927 13.1459 16.4954 7.4456 37.3432 23.0929 20.2916 0.4503 94.8231 84.6935 5.8583 26.9514 55.2505 5.2406 10.7201 48.2965 55.1144 33.9943 1.0232 12.0097 12.9410 6.4545 7.3824 3.5395 11.0591 49.6713 6.1894 10.9610 4.1875 3.1367 195.3869 23.4618 55.5594 9.5290 14.3181 35.2942 11.8613 11.9353 59.3841 13.6405 196.3280 436.0876 162.0078 95.7439 16.8659 8.8063 42.3529 1.8019 5.2014 7.2872 2.1201 0.6837 0.4709 149.9954 18.4959
temp: 298.150 k
press: 1.00000 atm
elementType: 16 8 8 8 7 7 6 6 6 6 6 6 1 1 1 1 1 1 1 1 1 1 1 1
symmnumber: 1
zpe: 494176.5 jmol-1
zpe.correction: 0.188222 hartree
zpe.thermalcorrener: 0.201646 hartree
zpe.thermalcorrenthalpy: 0.202590 hartree
zpe.thermalcorrgfe: 0.147775 hartree
zpe.sumelectzpe: -967.981690 hartree
zpe.sumelectthermal: -967.968265 hartree
zpe.sumelectthermalent: -967.967321 hartree
zpe.sumelectthermalfe: -968.022136 hartree
dipole: 2.3537 1.3638 0.4710
dipole: 2.7607
quadrupole: -95.8887 -83.0839 -73.8024
quadrupole: -21.1158 1.5335 1.0339
quadrupole: -11.6304 1.1744 10.4559 -21.1158 1.5335 1.0339
hfenergy: -968.1699114 hartree
pointgroup: C01 [X(C6H12N2O3S1)]
dipole: -0.9163325 0.5336488 -0.2350609 debye
dipolederiv: 1.4145385 -0.0353834 0.0066822 0.0922141 1.1572985 -0.0261819 -0.0351515 -0.0362937 1.0691668 -0.7586248 -0.1452938 0.0069146 0.0405797 -0.718912 0.0124206 0.037737 0.002835 -0.5259818 -0.8858137 0.1248618 -0.0282484 -0.0453644 -0.4809087 0.0019849 -0.0163513 0.019996 -0.5043515 -0.8733104 0.0998524 -0.016667 0.0816014 -0.965218 -0.0118836 -0.0540023 0.0097319 -0.3770202 -1.6875443 -0.168226 -0.0858768 0.0833084 -0.4088474 0.1097109 -0.2497777 0.0501831 -0.5085908 -1.0782812 -0.4013967 -0.0318029 -0.6310401 -0.6987606 -0.1003661 -0.1170005 -0.1090158 -0.5273516 0.5102572 0.1696026 -0.020838 0.6653768 0.2069662 -0.0931861 0.0850617 -0.1109979 0.2190924 -0.0528984 -0.0545913 -0.0170127 -0.1165542 -0.0395619 0.0319374 -0.0464888 0.0309845 -0.129709 -0.1349762 0.0718362 0.0012454 -0.0870429 0.104552 0.0336606 0.0484447 0.1854617 -0.1779427 0.0226553 -0.0273618 0.0338209 -0.0923387 -0.0643468 0.0286181 0.0543558 -0.0239482 -0.0916086 2.2377772 0.287334 0.1988672 0.364114 1.4433529 0.0684162 0.3305036 0.0725 0.3059071 0.6264735 0.1789282 0.03915 -0.063792 -0.0161131 0.0002185 0.0687516 0.0421893 0.2915686 0.0885753 0.0747424 0.0674695 -0.0625937 0.0404392 -0.0484684 0.0050608 -0.0019837 0.0782606 -0.0373367 -0.0175511 0.0111291 -0.0369418 -0.0060019 -0.0547883 0.0165526 -0.0378728 0.0803187 0.0992606 0.0019472 0.0362137 0.0184712 0.0366629 0.0348268 0.0234714 0.0320392 0.0130664 -0.0199426 -0.0981976 0.0083513 -0.0808753 -0.0950998 -0.0235416 0.0367757 -0.0595076 0.069272 0.0411004 0.0596416 -0.0924458 0.0576799 0.0555145 0.021938 -0.0802084 -0.0177097 0.0684153 0.0664225 -0.0238021 -0.0600975 0.0189231 -0.0105333 -0.0121419 -0.0482186 -0.0223082 0.019077 -0.0168022 -0.0003818 0.0302344 -0.0236705 0.0628164 0.0502717 0.0392005 0.0360167 0.0380856 0.369113 0.005075 -0.0440197 -0.2093198 0.1311507 -0.0246488 -0.0546187 -0.0492463 0.2856651 0.0880899 0.0420853 -0.0627743 0.0683836 0.1300599 0.0106085 -0.0591059 0.0166693 0.3401036 -0.0469776 -0.0505862 -0.0388071 -0.0687586 0.0591117 -0.1160878 -0.1232735 -0.1250461 -0.1077456 0.1559757 -0.0014633 0.0016232 0.1236661 0.0050766 0.0289268 0.0058501 0.0069196 0.1287364 -0.1277309 -0.0916718 0.0568889 -0.0960262 0.071302 0.0777556 0.1324318 0.0884036 -0.0564337 unknown
polarizability: 147.340386|2.9528161|106.4943985|3.6678809|-0.7782498|86.0916243 unknown
InChI: InChI=1S/C6H12N2O3S/c1-7-6(9)8-5-2-3-12(10,11)4-5/h5,7-8H,2-4H2,1H3
charge 0 multiplicity 1
24 atoms
S  2.388562 -0.636101 0.022446
O  1.571708 -2.076938 -0.00611
O  4.011975 -0.600775 0.155549
O  -2.490003 1.261384 0.072834
N  -0.705576 -0.210907 0.393881
N  -2.853821 -1.055574 -0.050535
C  0.230743 0.905687 0.554188
C  1.452364 0.454082 1.351623
C  0.750356 1.463606 -0.825515
C  1.707778 0.45924 -1.479437
C  -2.0518 0.065515 0.132465
C  -4.287082 -0.931235 -0.330344
H  -0.305044 1.723376 1.066968
H  2.146017 1.269027 1.605601
H  1.249865 -0.222707 2.192546
H  1.258797 2.428872 -0.648686
H  -0.13149 1.64894 -1.460923
H  1.229157 -0.286404 -2.129726
H  2.609654 0.892482 -1.933664
H  -0.298081 -1.152987 0.291801
H  -2.451844 -1.986811 0.062381
H  -4.556291 -1.424346 -1.283045
H  -4.514463 0.143921 -0.408261
H  -4.90048 -1.363047 0.482963
