program: Gaussian 09
title: 000274924
version: EM64L-G09RevD.01
frameworkgroup: C1[X(C15H14N4O)]
method: RPBEPBE
basis: SDD
operation: Freq
keyword: #p
keyword: freq=noraman
keyword: PBEPBE/SDD
title: #p freq=noraman PBEPBE/SDD
converged: YES YES NO NO
title: Mulliken charges:
elementType: O N N N N C C C C C C C C C C C C C C C H H H H H H H H H H H H H H
charge: -0.254634 -0.451699 0.071797 -0.712594 -0.569090 0.267716 0.294178 0.188571 0.274374 -0.345171 -0.566357 -0.590545 0.330556 0.183952 -0.411359 -0.371319 -0.237845 -0.279552 0.203666 -0.785574 0.237273 0.341809 0.242973 0.203985 0.226636 0.225192 0.322941 0.300669 0.302811 0.304582 0.329683 0.254686 0.254690 0.212999
chargesum: 0.00000
title: Mulliken charges with hydrogens summed into heavy atoms:
elementType: O N N N N C C C C C C C C C C C C C C C
charge: -0.254634 -0.128758 0.071797 -0.109114 0.065175 0.267716 0.294178 0.188571 0.274374 -0.345171 -0.329084 -0.248737 0.330556 0.183952 -0.168386 -0.167334 -0.011208 -0.054360 0.203666 -0.063199
polarizability: 3.54193387e+02 -2.57018417e+00 2.56311651e+02 -1.04961838e+00 -1.53375342e+00 8.20193985e+01
1716.lowfreq: -0.0007 -0.0004 -0.0003 0.7164 3.2355 7.6235 35.4565 54.7507 68.7545
frequency: 35.4501 54.7381 68.7359 77.7643 92.3799 98.0955 130.9401 171.9635 191.0953 193.3899 226.8772 239.7907 265.8622 284.7001 306.1284 352.8500 361.6390 391.4654 416.6348 430.1169 434.7951 445.7770 474.9700 516.0553 539.5626 555.3919 576.9374 592.0882 626.5794 631.2903 637.3563 650.1977 701.1876 709.8821 725.2763 739.2944 773.4609 784.7835 798.2967 823.7383 859.0897 877.1102 883.5479 930.4052 936.1752 952.1204 977.6370 979.6685 1004.9239 1035.3903 1038.7881 1051.1557 1083.6424 1118.0652 1155.7499 1173.3787 1190.1166 1200.0398 1214.1865 1228.6020 1252.6525 1269.2821 1292.8046 1355.5384 1381.8830 1386.3482 1399.6045 1441.7406 1449.8333 1450.8386 1464.8209 1471.4858 1491.2994 1495.3503 1573.8798 1584.4214 1590.9240 1612.4370 1615.9179 1626.5273 1643.4910 1648.1240 2992.8111 3092.4089 3098.8680 3120.1380 3122.4503 3127.3395 3141.4395 3161.6021 3198.3920 3454.3790 3469.6487 3482.0924 3604.9584 3672.4206
redmass: 5.5844 3.8263 2.1823 1.4321 5.0264 3.4926 3.3594 5.2232 2.6452 4.1813 2.0354 4.2882 2.4828 2.9139 3.3435 4.9050 3.1308 4.3477 3.9339 2.0272 3.1237 3.1324 2.6727 6.2851 4.9891 1.7360 3.9248 3.0851 2.3973 3.6185 4.4255 2.5471 3.6342 5.3414 5.4253 1.5755 1.2339 2.4673 3.1646 3.9208 1.5067 2.0135 5.1841 1.4493 4.9964 1.5027 1.3410 2.2382 2.2425 2.3824 1.6313 3.2349 1.4729 1.8237 3.1978 1.2889 2.3174 1.8595 2.5298 2.2400 1.5029 2.3077 1.6401 3.5328 6.4319 1.2258 3.7664 3.0211 1.0940 2.4965 1.7683 1.7995 3.7378 3.0882 8.0128 6.2321 6.3879 6.6731 5.5547 5.0930 1.2387 1.1421 1.0360 1.0994 1.0991 1.0855 1.0909 1.0891 1.0941 1.1002 1.0932 1.0759 1.0475 1.0445 1.0969 1.1015
irintensity: 3.2179 9.8506 9.4151 2.6661 7.3769 0.7979 4.2192 7.5521 16.1426 3.9260 35.5250 0.9424 25.7260 15.4382 22.4160 3.1147 22.3034 2.9066 19.5248 136.4862 59.4371 14.1198 4.0038 3.8433 11.6848 13.3306 21.7724 26.7151 149.1104 15.1429 1.6133 104.3579 3.5949 6.4467 4.6794 107.7187 78.5119 9.8789 21.8060 2.8060 11.3287 19.6188 2.0732 1.9292 3.8195 32.9491 0.2333 27.0868 1.7345 10.9049 15.4315 25.5112 8.9933 4.5902 87.7603 7.1047 43.4639 28.9678 17.2840 39.1661 0.8568 97.4829 17.5644 66.9961 15.2555 78.3817 17.3405 11.0395 16.4343 71.2156 150.6975 73.9913 88.8059 426.5027 135.6116 68.6310 69.0707 17.8776 168.1318 0.7936 65.2416 19.3458 19.6130 16.0454 13.4903 5.1330 21.0957 1.8297 36.3593 40.4423 4.8980 42.6770 10.9158 35.7545 15.3887 71.3716
temp: 298.150 k
press: 1.00000 atm
elementType: 8 7 7 7 7 6 6 6 6 6 6 6 6 6 6 6 6 6 6 6 1 1 1 1 1 1 1 1 1 1 1 1 1 1
symmnumber: 1
zpe: 695362.2 jmol-1
zpe.correction: 0.264849 hartree
zpe.thermalcorrener: 0.282644 hartree
zpe.thermalcorrenthalpy: 0.283588 hartree
zpe.thermalcorrgfe: 0.219092 hartree
zpe.sumelectzpe: -872.839074 hartree
zpe.sumelectthermal: -872.821280 hartree
zpe.sumelectthermalent: -872.820336 hartree
zpe.sumelectthermalfe: -872.884832 hartree
dipole: -0.7609 -3.3942 0.0702
dipole: 3.4791
quadrupole: -89.0530 -93.7259 -122.5539
quadrupole: -24.2480 0.6185 3.6997
quadrupole: 12.7246 8.0517 -20.7763 -24.2480 0.6185 3.6997
hfenergy: -873.1039239 hartree
pointgroup: C01 [X(C15H14N4O1)]
dipole: -0.3171918 -1.3311383 0.0323071 debye
polarizability: 354.0993867|-3.8936182|256.3881481|-1.7538191|-2.0169034|82.0369016 unknown
InChI: InChI=1S/C15H14N4O/c1-8(20)18-14-7-12-11(6-13(14)16)9-4-2-3-5-10(9)15(12)19-17/h2-7,18H,16-17H2,1H3
charge 0 multiplicity 1
34 atoms
O  3.934732 1.920852 -0.352009
N  3.581479 -0.365525 0.051092
N  -0.989969 2.652913 -0.058221
N  2.600748 -2.891787 -0.131395
N  -1.997834 3.561855 -0.056336
C  -0.6153 -0.941246 -0.040382
C  -0.096764 0.389053 -0.054048
C  -2.084333 -0.863029 -0.018707
C  -2.474702 0.525407 -0.02029
C  -1.229531 1.343955 -0.044702
C  0.259931 -2.044742 -0.081092
C  1.287757 0.637689 -0.059517
C  2.166541 -0.473115 -0.054435
C  1.655067 -1.817632 -0.105076
C  -3.053186 -1.885381 0.002603
C  -3.849845 0.856445 0.001937
C  -4.425105 -1.537469 0.022395
C  -4.818822 -0.177392 0.02227
C  4.379723 0.771784 -0.056173
C  5.865583 0.530323 0.213447
H  -0.121365 -3.072292 -0.120289
H  1.687747 1.65234 -0.056519
H  -2.753397 -2.939484 0.005235
H  -4.211516 1.89027 0.005502
H  -5.188667 -2.323055 0.038762
H  -5.883695 0.079697 0.038538
H  4.030483 -1.245973 0.331092
H  3.245765 -2.913968 -0.92711
H  2.234024 -3.812095 0.117023
H  -2.992202 3.327205 -0.053122
H  -1.706742 4.534249 -0.073587
H  6.171555 1.120913 1.094827
H  6.44962 0.901122 -0.646137
H  6.121621 -0.528887 0.391622
