program: Gaussian 09
title: 000274931
version: EM64L-G09RevD.01
frameworkgroup: C1[X(C21H14N2O3)]
method: RPBEPBE
basis: SDD
operation: Freq
keyword: #p
keyword: freq=noraman
keyword: PBEPBE/SDD
title: #p freq=noraman PBEPBE/SDD
converged: YES YES NO NO
title: Mulliken charges:
elementType: O O O N N C C C C C C C C C C C C C C C C C C C C C H H H H H H H H H H H H H H
charge: -0.262992 -0.255757 -0.261956 -0.431914 -0.072297 0.292434 0.304222 0.275145 0.112327 -0.504806 -0.024957 -0.385966 0.198137 -0.375562 -0.351908 -0.369399 -0.241210 -0.239980 0.499425 0.218704 0.173959 -0.495543 -0.378410 -0.396077 -0.336341 -0.203184 0.232387 0.330659 0.232817 0.224290 0.278564 0.258959 0.230456 0.235924 0.298131 0.233371 0.219957 0.255082 0.241557 0.241752
chargesum: 0.00000
title: Mulliken charges with hydrogens summed into heavy atoms:
elementType: O O O N N C C C C C C C C C C C C C C C C C C C C C
charge: -0.262992 -0.255757 -0.261956 -0.101255 -0.072297 0.292434 0.304222 0.275145 0.112327 -0.272419 -0.024957 -0.153149 0.198137 -0.151272 -0.073343 -0.110439 -0.010755 -0.004056 0.499425 0.218704 0.173959 -0.197412 -0.145039 -0.176120 -0.081259 0.280124
polarizability: 5.73678833e+02 -6.41359396e+00 2.71495546e+02 1.78616717e+00 7.42383292e+00 1.14638979e+02
1716.lowfreq: -24.6360 -7.9363 -2.3417 -0.0009 -0.0007 -0.0004 4.1922 19.8349 26.8366
frequency: -24.3892 19.7475 26.7972 34.1470 68.4005 93.1459 102.3183 125.1261 146.9379 195.1790 206.4497 218.1410 231.2099 250.3739 280.3188 316.2002 353.1697 389.1238 392.8366 402.4051 420.4947 423.0102 436.7529 441.7009 481.9145 502.8384 515.1351 531.0677 588.2603 599.0224 607.1793 626.1243 635.3268 645.6323 650.9539 680.7469 714.4333 724.0518 733.2803 737.1542 748.6216 768.2289 785.5329 792.8922 794.8702 811.3934 834.7117 840.4355 862.5342 881.2047 892.6226 902.1168 909.5259 931.6027 935.7000 959.0590 977.0844 977.5160 978.6789 1006.7539 1021.6807 1039.4898 1058.4988 1065.2295 1084.3133 1120.5506 1123.7007 1126.5146 1143.8789 1166.9643 1177.1565 1196.1962 1234.3178 1255.7723 1259.3456 1262.2502 1283.3856 1290.6294 1319.9571 1354.3258 1360.9406 1368.0580 1390.5373 1406.8829 1412.5310 1427.6163 1447.8476 1456.7817 1475.2665 1484.3540 1486.2314 1500.6266 1560.4020 1577.1304 1588.1026 1605.1709 1613.3676 1622.6981 1626.2299 1629.4783 2946.4837 3017.9323 3097.4848 3130.0112 3131.7723 3136.4047 3145.3174 3150.5158 3159.5562 3170.3451 3171.0310 3184.4968 3187.8187 3514.7796
redmass: 2.2557 6.1644 7.4028 6.2163 6.5007 5.0241 5.9910 5.9667 6.0088 6.3663 6.2344 3.8939 5.4301 5.1454 6.5267 8.1283 4.4172 6.4415 6.3972 7.0278 3.5007 3.8788 3.4045 3.7171 7.2397 5.1699 3.1893 7.3351 6.2910 4.3185 6.0875 5.7034 4.2602 2.0483 6.3015 9.6015 6.2763 4.2751 1.7326 2.5831 6.6664 6.4819 1.7838 2.7589 4.5741 1.3499 1.6263 9.5580 4.7593 1.8482 1.5165 5.7899 1.3887 1.3547 3.6056 1.3685 1.7254 1.4242 3.6257 1.3423 3.4970 2.1685 3.7157 1.4566 3.1046 1.0369 2.0032 1.5683 1.4093 2.0934 1.0896 2.0051 1.6593 1.3625 2.0404 2.5553 2.3369 2.4446 2.0555 1.9683 3.0725 1.4824 8.6565 3.0150 3.1486 3.4823 2.5864 4.2370 2.9457 3.0922 1.2429 3.4014 6.9112 6.8248 6.8339 7.1577 5.8755 8.1178 7.0333 5.5293 1.0859 1.0534 1.1191 1.0895 1.0858 1.0900 1.0901 1.0897 1.0935 1.0958 1.1001 1.0950 1.0939 1.0764
irintensity: 15.0552 0.8543 0.2000 0.0013 1.4838 0.3558 3.5004 3.6842 0.6542 0.7482 0.3869 12.2335 2.2921 0.6744 4.6280 7.8215 5.3346 6.5946 7.1433 23.7088 2.8702 13.2495 3.4991 2.4538 3.3621 3.9742 1.1031 7.3286 1.3000 9.7405 3.2411 15.4074 15.9970 1.8487 9.6931 0.3219 3.5667 2.3823 91.4213 21.5073 0.0566 21.1319 46.1933 3.8389 6.4007 26.8516 89.2777 18.5591 1.4082 21.0652 0.2777 9.8043 17.9394 6.6443 20.4146 0.9595 59.4458 11.3662 135.7675 0.6262 1.3103 15.6740 31.3560 4.3800 0.6789 0.0071 35.5445 10.9992 33.3216 8.8919 1.2129 79.6127 15.5763 6.1979 193.8126 223.9402 6.8085 54.9964 112.0713 30.1420 2.1933 15.1794 93.1261 13.9983 34.1281 23.6793 59.7626 200.5263 64.9796 46.7128 22.5898 73.4603 1.0739 170.8790 33.5708 31.2983 67.8855 0.3959 75.0766 525.1728 54.6313 160.9948 29.2359 17.6060 2.7232 7.7519 5.7373 5.0575 15.0759 10.7222 22.2232 4.0777 7.7134 43.6147
temp: 298.150 k
press: 1.00000 atm
elementType: 8 8 8 7 7 6 6 6 6 6 6 6 6 6 6 6 6 6 6 6 6 6 6 6 6 6 1 1 1 1 1 1 1 1 1 1 1 1 1 1
symmnumber: 1
zpe: 782995.1 jmol-1
zpe.correction: 0.298227 hartree
zpe.thermalcorrener: 0.317400 hartree
zpe.thermalcorrenthalpy: 0.318344 hartree
zpe.thermalcorrgfe: 0.248850 hartree
zpe.sumelectzpe: -1142.057480 hartree
zpe.sumelectthermal: -1142.038307 hartree
zpe.sumelectthermalent: -1142.037363 hartree
zpe.sumelectthermalfe: -1142.106857 hartree
dipole: -4.8439 1.9779 0.4146
dipole: 5.2485
quadrupole: -157.0357 -130.2963 -153.1052
quadrupole: 8.3206 1.3272 -0.6307
quadrupole: -10.2233 16.5161 -6.2928 8.3206 1.3272 -0.6307
hfenergy: -1142.3557069 hartree
pointgroup: C01[X(C21H14N2O3)]
dipole: -1.9008527 -0.6927987 -0.4131691 debye
polarizability: 573.5127534|10.0119228|248.2646602|-1.8210142|56.3247509|138.0359445 unknown
InChI: InChI=1S/C21H14N2O3/c24-21-16-4-2-1-3-15(16)17-10-14(6-7-18(17)23-21)22-11-13-5-8-19-20(9-13)26-12-25-19/h1-11,23H,12H2
charge 0 multiplicity 1
40 atoms
O  -6.479028 0.671631 1.322843
O  -7.401338 -0.864835 -0.277605
O  6.560822 1.374555 0.34931
N  4.313492 1.931125 0.510356
N  -1.255199 0.950359 0.316384
C  2.488956 0.342825 0.127648
C  3.500587 -0.700793 -0.121851
C  2.938355 1.662899 0.450739
C  4.892058 -0.365522 -0.05471
C  1.090783 0.11141 0.069157
C  5.34563 1.010095 0.273643
C  2.003752 2.696125 0.729325
C  0.149637 1.140132 0.326832
C  3.157925 -2.04807 -0.436082
C  5.888505 -1.345288 -0.297663
C  0.629874 2.435489 0.684174
C  4.150946 -3.013379 -0.673759
C  5.526271 -2.66585 -0.607178
C  -3.273525 -0.163743 -0.469865
C  -5.459768 0.171481 0.47404
C  -6.009934 -0.733213 -0.467899
C  -4.105929 0.478382 0.504511
C  -3.834582 -1.070098 -1.412787
C  -1.830899 0.106057 -0.507868
C  -5.220164 -1.372375 -1.427423
C  -7.73813 0.03084 0.866809
H  0.71946 -0.895898 -0.144598
H  4.625517 2.878685 0.744408
H  2.365988 3.697557 0.9901
H  2.107294 -2.348294 -0.493474
H  6.935447 -1.031362 -0.233272
H  -0.103294 3.214866 0.911755
H  3.859565 -4.042402 -0.911918
H  6.295221 -3.422438 -0.794566
H  -3.662543 1.171858 1.22245
H  -3.177875 -1.546983 -2.149593
H  -1.260826 -0.432479 -1.295239
H  -5.653551 -2.06781 -2.149819
H  -8.435061 0.810231 0.514509
H  -8.151639 -0.580766 1.686574
