program: Gaussian 09
title: 000026446
version: EM64L-G09RevD.01
frameworkgroup: C1[X(C10H8N2O3)]
method: RPBEPBE
basis: SDD
operation: Freq
keyword: #p
keyword: freq=noraman
keyword: PBEPBE/SDD
title: #p freq=noraman PBEPBE/SDD
converged: YES YES NO YES
title: Mulliken charges:
elementType: O O O N N C C C C C C C C C C H H H H H H H H
charge: -0.293056 -0.228196 -0.210098 -0.040547 0.023114 0.250847 0.194554 0.133193 0.391747 -0.435047 -0.345111 -0.355894 -0.770094 -0.243892 -0.211314 0.300853 0.314078 0.302573 0.263683 0.263821 0.210258 0.240581 0.243947
chargesum: 0.00000
title: Mulliken charges with hydrogens summed into heavy atoms:
elementType: O O O N N C C C C C C C C C C
charge: -0.293056 -0.228196 -0.210098 -0.040547 0.023114 0.250847 0.194554 0.133193 0.391747 -0.134194 -0.031033 -0.053321 -0.032332 -0.003311 0.032633
polarizability: 2.11516000e+02 5.32589273e-01 1.83245361e+02 -2.34334433e-02 1.44821019e-02 5.47118224e+01
1716.lowfreq: -67.9582 -4.1409 -0.0011 -0.0008 -0.0008 3.1518 7.1309 51.2384 107.2806
frequency: -67.9570 51.2077 107.2788 169.2743 231.7054 261.0327 275.1622 311.3196 336.2463 336.7324 360.9429 394.4500 427.3965 445.5269 508.0472 511.0579 594.1736 616.8692 634.4575 634.9933 648.0063 697.4920 749.2107 758.2078 787.7298 793.8170 865.0899 898.6368 932.6292 993.0388 1012.4867 1026.2900 1031.8178 1037.0262 1051.7865 1090.9968 1157.0989 1172.6518 1179.1013 1198.6093 1241.9298 1270.8058 1319.4016 1333.6621 1358.7591 1389.4400 1403.1497 1426.8184 1448.6764 1451.3212 1462.9799 1506.6804 1529.5892 1581.7950 1614.9763 3001.3689 3092.4128 3100.9984 3145.8278 3164.8087 3187.5287 3205.7008 3229.3649
redmass: 10.0242 5.3513 4.0434 5.5398 3.6222 8.0774 1.0755 7.6688 5.9378 11.3645 3.3123 10.7649 3.4948 6.2483 3.3710 6.9950 5.2566 7.0742 6.3110 3.3215 5.8580 6.4073 7.6950 4.7502 1.3683 6.0389 1.4459 1.4003 5.7630 1.3460 1.3247 2.5742 2.0208 1.5369 2.4487 3.3102 1.9320 1.2868 5.7347 2.3196 2.4813 2.6576 3.5073 3.2770 5.1447 3.2346 1.3370 3.4046 1.0464 2.2936 1.2741 3.5241 5.0555 6.6364 6.5414 1.0364 1.0962 1.1015 1.0880 1.0937 1.0966 1.0933 1.0928
irintensity: 0.0005 8.3033 0.2096 0.1632 0.3643 4.7954 1.5915 6.3721 0.0870 0.6781 0.9845 5.1769 3.7262 0.3388 0.1626 2.8263 17.3341 18.9484 9.5080 1.3651 0.3235 0.6964 2.2358 1.9119 88.7055 5.2654 23.5804 0.0009 1.1872 5.4090 0.1809 1.4706 24.0869 10.6621 8.8341 8.4963 59.3680 68.2365 342.1271 19.5266 74.7187 53.0322 25.2699 19.7407 66.7236 40.4356 19.0181 26.2226 13.6624 7.4623 28.1570 8.1643 72.2961 52.2759 3.2826 11.9118 3.5410 26.1298 7.9368 13.0427 7.2890 0.5406 13.2387
temp: 298.150 k
press: 1.00000 atm
elementType: 8 8 8 7 7 6 6 6 6 6 6 6 6 6 6 1 1 1 1 1 1 1 1
symmnumber: 1
zpe: 435187.0 jmol-1
zpe.correction: 0.165754 hartree
zpe.thermalcorrener: 0.176765 hartree
zpe.thermalcorrenthalpy: 0.177709 hartree
zpe.thermalcorrgfe: 0.128805 hartree
zpe.sumelectzpe: -719.855548 hartree
zpe.sumelectthermal: -719.844538 hartree
zpe.sumelectthermalent: -719.843594 hartree
zpe.sumelectthermalfe: -719.892497 hartree
dipole: 2.0790 0.9540 0.0023
dipole: 2.2874
quadrupole: -87.6719 -89.5908 -87.2194
quadrupole: -20.4945 0.0080 -0.0121
quadrupole: 0.4888 -1.4301 0.9413 -20.4945 0.0080 -0.0121
hfenergy: -720.0213024 hartree
pointgroup: C01 [X(C10H8N2O3)]
dipole: 0.8175805 -0.3760839 -0.0009093 debye
dipolederiv: -0.7266475 0.4317308 -0.0000777 0.3496698 -0.8011691 0.0001319 -0.0001056 0.0001434 -0.2786639 -0.4289042 -0.070613 -0.0004983 0.1807478 -1.0063226 -0.0013838 -0.0002563 -0.0015772 -0.2424857 -1.1465253 0.0870524 -0.0013562 -0.0863646 -0.4163444 -0.0006203 -0.0014647 -0.0005677 -0.2201153 0.7784728 -0.4367183 0.0001453 -0.1529913 0.8067247 -0.0001944 0.0000938 -0.0001909 0.133252 1.6601876 -0.4140394 0.0021171 -0.5619362 1.4988862 0.0025305 0.0019225 0.0024345 0.1758853 0.1842825 -0.1036636 -0.0000338 0.3146882 0.0685654 -0.0000892 0.0003014 -0.0004918 0.0773145 0.1816124 0.0092508 -0.0000163 0.0772422 -0.4532243 0.0001145 0.0000733 0.0000524 0.0216555 -0.5061472 0.3652018 -0.0002776 0.5343273 -0.6192238 -0.0003726 -0.0001572 -0.0002332 -0.0074316 0.4987157 0.1035452 0.0000402 -0.3871055 0.3967757 -0.0000013 -0.0003758 0.0004882 0.0656756 -0.6765146 0.2209273 -0.0000208 0.0248451 0.1014783 -0.0000259 -0.0000884 0.0000097 -0.1526789 -0.277402 -0.0943598 0.0000251 -0.1833801 -0.0058864 -0.0000395 0.0000583 0.000055 -0.1418831 -0.0964968 0.0915857 -0.000044 -0.1396326 0.0103737 0.0000017 0.0000222 0.0000359 -0.1251866 -0.2526985 -0.2032766 -0.0000513 0.0102426 0.1873778 -0.0002012 -0.0001879 -0.0001429 0.0000287 0.0670924 -0.0454806 -0.000044 0.0167324 0.2778865 -0.0001192 -0.0001418 0.0000075 -0.122952 0.18923 0.0024915 -0.0000187 0.0777511 -0.1914282 0.000006 0.0000387 0.0000555 -0.1367317 0.0610751 -0.0056221 -0.0000049 -0.0128861 0.0431969 0.0000191 0.0000529 0.0000099 0.1748469 0.1575928 0.1076811 0.0000236 -0.0097189 0.0915681 0.0000713 0.0000328 -0.0001625 0.1711679 0.1218183 -0.0149361 0.0000035 0.0965905 0.0626942 0.0000133 -0.0000589 0.0000174 0.1753275 0.0708417 -0.0049282 0.0539481 0.0166878 0.0523726 -0.0611748 0.0515121 -0.027827 0.0070361 0.0708676 -0.0051194 -0.0538725 0.0165766 0.0527435 0.0610365 -0.0514136 0.0276355 0.0069716 0.0930974 0.0786087 -0.0000358 -0.0713358 -0.166882 0.0001983 0.0001127 0.0002295 0.1062011 0.0710024 -0.0569966 0.0000337 -0.0722379 -0.0773301 0.0000793 -0.0000018 0.0000378 0.1540455 -0.0945525 -0.0423215 0.0000153 -0.0385124 0.087167 0.0000198 0.0000313 -0.000019 0.1587206 unknown
polarizability: 211.5149842|-0.5588996|183.2463771|0.0234469|0.0144603|54.7118224 unknown
InChI: InChI=1S/C10H8N2O3/c1-7-6-11(13)9-5-3-2-4-8(9)10(7)12(14)15/h2-6H,1H3
charge 0 multiplicity 1
23 atoms
O  1.82828 -2.76123 0.000589
O  -1.878853 2.487013 0.003523
O  -3.411698 0.824298 -0.002803
N  0.911115 -1.805442 0.000272
N  -2.176584 1.224052 -0.000009
C  0.302296 0.607805 -0.000073
C  1.30399 -0.432275 0.000067
C  -1.103512 0.21551 -0.00014
C  -1.458617 -1.165287 -0.000158
C  -0.422337 -2.124456 0.000139
C  0.813581 1.95243 -0.000461
C  2.697673 -0.166668 -0.000026
C  -2.858383 -1.750269 -0.000154
C  2.189332 2.211429 -0.000647
C  3.144158 1.156484 -0.000369
H  -0.6240 -3.195786 0.000298
H  0.106542 2.778323 -0.000491
H  3.37767 -1.021757 0.000136
H  -3.437411 -1.416613 0.876816
H  -3.436731 -1.418118 -0.878122
H  -2.804135 -2.852208 0.000838
H  2.530174 3.252151 -0.000969
H  4.216051 1.377613 -0.000455
