program: Gaussian 09
title: 000274890
version: EM64L-G09RevD.01
frameworkgroup: C1[X(C18H10N2)]
method: RPBEPBE
basis: SDD
operation: Freq
keyword: #pfreq=noraman
keyword: PBEPBE/SDD
title: #p freq=noraman PBEPBE/SDD
converged: NO YES NO NO
title: Mulliken charges:
elementType: N N C C C C C C C C C C C C C C C C C C H H H H H H H H H H
charge: 0.005954 -0.004552 0.241723 0.168998 0.231368 0.442480 0.379183 -0.693588 -0.392042 -0.350808 -0.372589 -0.446654 -0.259153 -0.266491 -0.246783 -0.245905 -0.343569 0.288747 -0.258709 -0.265875 0.254980 0.229868 0.229020 0.224437 0.262808 0.236404 0.236665 0.235434 0.240225 0.238424
chargesum: 0.00000
title: Mulliken charges with hydrogens summed into heavy atoms:
elementType: N N C C C C C C C C C C C C C C C C C C
charge: 0.005954 -0.004552 0.241723 0.168998 0.231368 0.442480 0.379183 -0.438608 -0.162174 -0.121789 -0.148152 -0.183846 -0.022749 -0.029826 -0.011348 -0.005680 -0.105146 0.288747 -0.258709 -0.265875
polarizability: 3.62632609e+02 -1.92863712e+01 2.79898059e+02 8.87590240e-01 -1.54126917e+00 7.99627006e+01
1716.lowfreq: -7.0735 -0.0007 -0.0002 0.0001 1.6191 7.8315 13.2345 47.6671 77.9689
frequency: 12.9638 47.6509 77.9658 93.6699 98.4003 127.5585 157.8497 189.6469 234.8638 241.5050 264.7285 301.3173 326.6502 401.7420 412.4593 418.0679 430.0549 467.6181 472.4614 505.5303 527.9417 560.0117 581.6096 597.0044 613.9024 629.0099 649.2020 679.0776 703.2105 736.5491 764.3642 773.0229 789.8698 798.5222 810.0990 873.4802 886.2083 890.5811 923.2747 947.5679 958.7719 972.6645 991.4721 994.4978 999.4819 1040.7577 1047.6118 1067.8883 1111.4514 1149.8912 1157.1428 1181.7555 1190.1839 1231.8202 1263.2654 1269.4067 1288.7830 1323.0946 1366.2352 1379.9771 1398.2363 1412.6235 1437.5977 1447.5388 1452.5849 1494.7040 1533.0322 1562.5505 1577.3265 1596.7823 1619.5893 1622.4038 2160.0696 2172.3365 3132.1246 3135.5712 3140.2934 3143.1270 3150.4445 3157.9386 3164.5479 3166.5695 3171.4247 3176.1798
redmass: 9.3145 5.5278 7.9910 3.9344 4.4477 12.1398 6.8058 8.6019 5.8810 3.9728 5.4602 6.8654 3.6157 6.0864 4.2866 8.1059 3.6148 5.7285 5.2565 3.0316 5.8152 3.2128 7.3731 12.0867 6.8834 3.5828 5.1371 6.2214 5.7177 2.3808 1.3875 1.8679 4.1368 5.4292 1.7852 1.3787 2.7125 2.6826 1.5954 1.8533 1.4090 1.4685 6.6892 1.3862 1.3611 2.2609 3.1618 2.5412 2.3127 4.3285 1.4452 1.0762 1.1118 1.5040 1.8725 2.1169 2.0364 2.3653 1.7508 3.2741 3.4028 4.0751 2.3602 2.6668 3.0372 2.9308 3.6085 5.9289 7.0566 5.6491 5.8920 6.3689 12.6218 12.6361 1.0865 1.0857 1.0895 1.0890 1.0890 1.0939 1.0937 1.0911 1.1001 1.0980
irintensity: 0.9563 0.9536 1.4895 0.4356 0.1034 4.2033 5.2748 4.4908 0.6459 1.2391 0.4971 1.3530 0.1744 2.4691 3.7218 5.4423 4.9282 0.3851 0.5411 3.1414 4.1349 0.1463 3.9483 0.5418 3.5472 0.7004 1.3249 3.7512 0.4306 51.1633 58.3483 40.8835 23.8293 2.5323 4.2344 2.1377 5.8481 2.7620 11.5393 18.7401 0.3611 10.8945 0.9955 0.6133 0.2158 3.7631 4.0263 5.2318 5.9675 2.7291 4.6897 0.4994 1.2542 25.4052 25.1739 9.8531 3.9974 2.7816 2.7651 12.9549 36.0478 20.8871 9.2602 28.5149 30.2553 16.6716 24.6825 249.4860 0.0453 4.3031 8.8915 10.0621 7.3823 80.3985 0.8467 0.2760 4.1702 2.0702 15.6645 8.6424 15.0289 1.8405 47.6092 26.7808
temp: 298.150 k
press: 1.00000 atm
elementType: 7 7 6 6 6 6 6 6 6 6 6 6 6 6 6 6 6 6 6 6 1 1 1 1 1 1 1 1 1 1
symmnumber: 1
zpe: 580362.1 jmol-1
zpe.correction: 0.221048 hartree
zpe.thermalcorrener: 0.236647 hartree
zpe.thermalcorrenthalpy: 0.237591 hartree
zpe.thermalcorrgfe: 0.176458 hartree
zpe.sumelectzpe: -800.083159 hartree
zpe.sumelectthermal: -800.067560 hartree
zpe.sumelectthermalent: -800.066616 hartree
zpe.sumelectthermalfe: -800.127749 hartree
dipole: 7.4218 2.1117 -0.5325
dipole: 7.7347
quadrupole: -133.1257 -105.0315 -121.2303
quadrupole: -6.3985 0.5360 4.3809
quadrupole: -13.3299 14.7643 -1.4345 -6.3985 0.5360 4.3809
hfenergy: -800.3042073 hartree
pointgroup: C01 [X(C18H10N2)]
dipole: -2.6897591 -1.4104756 -0.1896093 debye
polarizability: 365.700554|1.2562402|273.3750738|-18.5358014|20.8562575|83.4177405 unknown
InChI: InChI=1S/C18H10N2/c19-11-13(12-20)9-15-10-14-5-1-2-6-16(14)18-8-4-3-7-17(15)18/h1-10H
charge 0 multiplicity 1
30 atoms
N  5.630501 0.725716 -0.754324
N  2.555047 3.484082 0.86364
C  -1.405663 -1.285625 -0.109389
C  -2.169123 -0.03928 0.011824
C  0.035479 -1.247119 -0.210967
C  -1.454891 1.213099 0.029461
C  0.729505 0.053393 -0.213916
C  -0.027382 1.223535 -0.086976
C  -2.058843 -2.556555 -0.118002
C  -3.591953 0.00522 0.117835
C  0.746039 -2.486366 -0.282651
C  -2.169213 2.448707 0.150949
C  -1.339305 -3.753022 -0.21161
C  0.078694 -3.717216 -0.288457
C  -4.274835 1.224633 0.237896
C  -3.562389 2.459087 0.256442
C  2.175066 0.096097 -0.403551
C  3.08831 1.119189 -0.169463
C  4.478537 0.90796 -0.485455
C  2.778369 2.406017 0.39301
H  0.463614 2.200373 -0.107001
H  -3.148567 -2.607005 -0.04608
H  -4.175434 -0.919427 0.107499
H  1.838985 -2.496094 -0.314111
H  -1.602242 3.386466 0.163841
H  -1.866284 -4.712759 -0.21649
H  0.650455 -4.64934 -0.344936
H  -5.367279 1.228288 0.318151
H  -4.105957 3.404375 0.35207
H  2.636561 -0.814827 -0.800841
