program: Gaussian 09
title: 000274888
version: EM64L-G09RevD.01
frameworkgroup: C1[X(C16H13NO2)]
method: RPBEPBE
basis: SDD
operation: Freq
keyword: #p
keyword: freq=noraman
keyword: PBEPBE/SDD
title: #p freq=noraman PBEPBE/SDD
converged: YES YES NO NO
title: Mulliken charges:
elementType: O O N C C C C C C C C C C C C C C C C H H H H H H H H H H H H H
charge: -0.262282 -0.257072 -0.036896 0.359992 0.382616 0.513451 -0.520791 -0.434809 -0.439327 -0.410102 -0.403195 -0.332484 -0.240740 -0.233770 0.111515 0.195065 -0.259687 -0.665285 -0.210615 0.266107 0.241965 0.237727 0.253803 0.243217 0.266502 0.235605 0.233419 0.229530 0.234884 0.219333 0.248287 0.234035
chargesum: 0.00000
title: Mulliken charges with hydrogens summed into heavy atoms:
elementType: O O N C C C C C C C C C C C C C C C C
charge: -0.262282 -0.257072 -0.036896 0.359992 0.382616 0.513451 -0.254684 -0.192844 -0.201600 -0.156299 -0.159978 -0.065982 -0.005135 -0.000351 0.111515 0.195065 0.204728 0.036371 -0.210615
polarizability: 3.81799930e+02 4.11634110e+00 1.98178197e+02 7.20731338e+00 -1.94318551e-01 8.27368897e+01
1716.lowfreq: -7.3951 -1.4393 -0.0005 0.0003 0.0005 5.4058 29.8451 34.7549 46.6147
frequency: 29.8302 34.7040 46.5735 68.3095 76.3295 92.1212 135.0825 164.7734 170.6652 186.4405 219.1830 239.7853 270.2151 308.7395 344.5175 356.9848 408.9276 417.6500 442.0971 473.7495 494.1414 510.0945 514.9498 517.8165 588.1068 619.6134 662.8452 706.4349 727.1821 732.7577 753.9366 761.8908 764.2577 788.4058 817.5277 832.8693 850.2790 879.9502 908.5020 929.7885 953.8667 965.2094 980.3591 996.0271 999.9457 1006.8399 1022.7769 1067.2061 1096.0404 1129.2866 1157.6546 1163.4699 1175.4517 1182.4794 1216.7104 1242.0190 1270.9454 1279.6115 1286.1722 1352.2349 1356.9987 1384.8971 1393.4062 1415.3542 1426.2270 1439.7789 1456.8824 1464.8951 1465.7160 1484.5543 1506.9337 1571.6454 1580.8158 1604.3578 1619.9333 1636.7470 2160.9069 2994.3974 3031.9430 3089.9536 3096.7907 3097.6419 3122.9124 3124.1055 3125.8639 3132.4123 3147.1113 3148.3332 3166.1451 3168.2364
redmass: 5.3417 3.9923 3.9540 5.8369 4.4513 4.8452 6.0540 5.0781 5.3941 3.6624 1.7854 2.7284 5.8742 2.9246 3.6847 5.3008 3.2391 4.1748 4.8220 2.4734 7.2111 6.9110 3.9850 8.4451 6.3867 6.6878 2.6386 5.3394 7.6009 5.3853 3.6188 1.3140 5.1637 2.6208 1.3746 1.3378 4.0675 1.4885 4.9368 1.6277 3.7896 1.3653 1.4288 1.4059 1.4174 2.7031 2.2777 4.7786 2.1620 1.6961 1.7314 1.5063 1.1165 1.7805 2.0727 2.2049 2.0485 1.1186 1.7605 1.8699 1.3459 1.6116 1.2321 4.7606 2.7229 4.6314 1.1025 1.0591 2.3846 1.0521 3.5098 6.5188 7.4330 5.5396 8.5194 6.7184 12.6189 1.0362 1.0600 1.0974 1.1023 1.0882 1.1064 1.0869 1.0863 1.0891 1.0967 1.0965 1.1002 1.0919
irintensity: 2.0313 0.5577 0.5689 1.3414 0.7020 0.2262 2.3909 2.9939 4.6721 0.1773 2.9172 0.6898 1.2291 17.1069 0.0504 4.5110 0.1584 0.9996 10.4635 26.6030 7.3528 0.4069 2.7252 9.0081 0.2517 1.3543 1.4469 5.8604 12.2825 1.4572 8.1255 48.7987 2.9531 0.0263 3.5112 48.9401 10.8075 21.8082 11.2638 7.7494 0.6785 0.0009 17.9459 5.7470 3.9476 39.0529 10.3853 274.8302 35.6870 15.1348 105.2918 25.6312 13.8017 397.4448 143.7869 46.8586 64.8123 11.0163 20.7465 0.8019 10.8371 8.2334 24.5720 8.6072 33.5671 0.4051 27.8977 14.5176 4.8005 15.6330 31.7099 86.8848 406.8258 2.3618 113.7921 9.7315 18.0228 22.5241 35.4534 39.9700 2.0042 0.1721 28.3155 1.4621 3.6411 0.3490 2.7221 41.6332 34.0949 4.0548
temp: 298.150 k
press: 1.00000 atm
elementType: 8 8 7 6 6 6 6 6 6 6 6 6 6 6 6 6 6 6 6 1 1 1 1 1 1 1 1 1 1 1 1 1
symmnumber: 1
zpe: 644836.4 jmol-1
zpe.correction: 0.245605 hartree
zpe.thermalcorrener: 0.262493 hartree
zpe.thermalcorrenthalpy: 0.263437 hartree
zpe.thermalcorrgfe: 0.199286 hartree
zpe.sumelectzpe: -821.374175 hartree
zpe.sumelectthermal: -821.357287 hartree
zpe.sumelectthermalent: -821.356343 hartree
zpe.sumelectthermalfe: -821.420495 hartree
dipole: 1.9860 -2.0224 0.3383
dipole: 2.8546
quadrupole: -75.8645 -113.9401 -114.1081
quadrupole: -1.6316 0.0938 0.1795
quadrupole: 25.4398 -12.6359 -12.8039 -1.6316 0.0938 0.1795
hfenergy: -821.6197803 hartree
pointgroup: C01 [X(C16H13N1O2)]
dipole: -0.751074 0.604548 0.5759553 debye
polarizability: 381.4889118|5.2783642|162.7221975|-11.8928981|53.0798842|118.5039076 unknown
InChI: InChI=1S/C16H13NO2/c1-2-19-16(18)15(11-17)10-12-7-8-13-5-3-4-6-14(13)9-12/h3-10H,2H2,1H3
charge 0 multiplicity 1
32 atoms
O  4.264021 -0.497968 -0.857288
O  3.797167 1.374286 0.46466
N  1.469233 -2.204526 -1.766656
C  -2.621849 -0.378634 -0.24273
C  -3.304233 0.660797 0.505334
C  -0.434911 0.653009 0.284771
C  -1.198284 -0.359986 -0.33755
C  -2.517264 1.685048 1.131997
C  -1.131787 1.681754 1.025942
C  -3.400018 -1.408721 -0.873899
C  -4.732844 0.630884 0.593498
C  1.019876 0.751759 0.243804
C  -4.791666 -1.41201 -0.770453
C  -5.46292 -0.384412 -0.031247
C  1.981671 -0.041998 -0.358124
C  3.412563 0.371404 -0.187827
C  5.730493 -0.213664 -0.755327
C  6.31651 -0.855594 0.504856
C  1.707464 -1.220584 -1.126546
H  -0.70785 -1.154329 -0.907351
H  -3.026074 2.473717 1.698081
H  -0.542241 2.469666 1.509536
H  -2.881471 -2.192644 -1.438016
H  -5.2479 1.41656 1.158645
H  1.449534 1.608425 0.785294
H  -5.378417 -2.200241 -1.253789
H  -6.555905 -0.399511 0.04144
H  6.139417 -0.657154 -1.676634
H  5.875213 0.880971 -0.757548
H  7.413305 -0.714883 0.515717
H  5.901091 -0.389917 1.414176
H  6.107078 -1.938703 0.527336
