program: Gaussian 09
title: 000274869
version: EM64L-G09RevD.01
frameworkgroup: C1[X(C15H13NO)]
method: RPBEPBE
basis: SDD
operation: Freq
keyword: #p
keyword: freq=noraman
keyword: PBEPBE/SDD
title: #p freq=noraman PBEPBE/SDD
converged: NO YES NO NO
title: Mulliken charges:
elementType: O N C C C C C C C C C C C C C C C H H H H H H H H H H H H H
charge: -0.235769 -0.230595 0.215593 0.236014 0.176729 0.215919 -0.523605 -0.361297 -0.393406 0.343035 -0.359690 -0.653571 -0.381497 -0.253531 -0.224647 0.076292 -0.794621 0.249593 0.231522 0.235625 0.240603 0.241405 0.242825 0.242731 0.278970 0.225712 0.225260 0.236902 0.236912 0.260584
chargesum: 0.00000
title: Mulliken charges with hydrogens summed into heavy atoms:
elementType: O N C C C C C C C C C C C C C C C
charge: -0.235769 -0.230595 0.215593 0.236014 0.176729 0.215919 -0.274011 -0.129775 -0.157781 0.343035 -0.119086 0.073391 -0.102527 -0.027819 0.000613 0.076292 -0.060223
polarizability: 2.98542877e+02 -1.33804476e+01 1.88565090e+02 -1.99091892e-03 9.64498276e-03 7.53904902e+01
1716.lowfreq: -4.6148 -0.0004 0.0006 0.0007 3.2830 5.8569 53.0959 57.3193 73.3497
frequency: 52.7484 57.3040 73.2836 121.1386 124.5024 135.9142 142.7944 191.6377 233.1915 254.3651 302.0457 314.8593 341.4743 425.3349 425.8290 451.6356 466.2201 534.8614 546.5294 571.0630 571.1848 590.1023 624.4844 645.3000 661.3600 719.9175 743.8297 756.2228 779.6873 826.8084 829.7391 850.6683 856.8032 909.5645 937.7767 942.7324 976.0646 982.9974 1003.6857 1019.7010 1025.8550 1046.2346 1071.5495 1119.7085 1123.6794 1128.9328 1149.6363 1169.2844 1224.0152 1253.7199 1263.7924 1307.5177 1324.1214 1360.8318 1366.8268 1396.1343 1406.4069 1434.1558 1447.0412 1449.6063 1463.5225 1465.6149 1472.6339 1475.9103 1487.0247 1505.1632 1561.9098 1589.4477 1594.0168 1611.0876 1638.9594 2978.9971 2983.5007 3053.8558 3068.2968 3118.8212 3123.5994 3128.4781 3137.0746 3139.5619 3147.0506 3151.1154 3163.3901 3166.4053
redmass: 1.1950 3.5977 3.4365 3.5659 4.7364 3.1995 1.0715 4.3620 4.1500 3.1342 4.6395 6.1754 5.7364 3.4739 3.0075 2.9140 6.8464 3.4019 5.1721 4.6549 3.6635 4.6508 6.6195 2.8795 4.9722 5.7555 1.9914 2.1999 2.9803 5.4821 1.4511 3.9966 1.4531 1.5326 1.3998 2.1310 1.3123 1.3337 3.7506 2.0961 1.8323 4.0924 2.4413 1.3070 1.6673 1.5013 1.3983 1.0979 2.5734 1.7642 2.1032 2.1083 2.1719 2.0500 1.6245 4.2894 5.1241 1.8697 1.1155 2.6156 1.0497 2.2993 1.0409 2.2821 1.8051 2.2650 6.6034 7.0003 7.6163 7.3936 7.5570 1.0367 1.0372 1.1019 1.0971 1.0970 1.0992 1.0852 1.0894 1.0882 1.0912 1.0948 1.0958 1.1002
irintensity: 0.0017 6.4579 0.1612 0.1631 1.9121 4.8284 1.4920 0.6182 5.7306 0.7486 0.0782 0.4353 0.4624 0.9751 5.8546 0.1851 3.3926 0.6137 9.9368 21.8449 1.9676 1.6654 5.5177 15.3325 3.4807 0.6672 34.7019 49.3329 13.6965 8.9075 47.8565 7.8282 0.0122 16.2595 1.5145 39.7277 0.0005 1.6071 2.3191 16.4663 0.9438 3.0628 6.0437 0.6347 34.8710 27.2218 36.6088 5.7741 31.6440 29.0994 221.6230 73.4523 66.7505 57.1200 124.3514 18.1693 8.9157 3.8238 42.9903 3.3232 19.4605 13.4873 14.3918 18.4025 73.0988 43.7853 144.5139 8.6667 181.7121 37.0854 31.7616 69.3537 4.2765 24.9718 14.3140 7.8675 21.5901 0.3040 4.4264 9.6052 3.8007 30.3758 9.1537 30.3741
temp: 298.150 k
press: 1.00000 atm
elementType: 8 7 6 6 6 6 6 6 6 6 6 6 6 6 6 6 6 1 1 1 1 1 1 1 1 1 1 1 1 1
symmnumber: 1
zpe: 623791.8 jmol-1
zpe.correction: 0.237590 hartree
zpe.thermalcorrener: 0.252031 hartree
zpe.thermalcorrenthalpy: 0.252975 hartree
zpe.thermalcorrgfe: 0.195870 hartree
zpe.sumelectzpe: -708.224294 hartree
zpe.sumelectthermal: -708.209853 hartree
zpe.sumelectthermalent: -708.208909 hartree
zpe.sumelectthermalfe: -708.266014 hartree
dipole: 5.1153 0.4595 0.0001
dipole: 5.1359
quadrupole: -111.8828 -80.0165 -104.3130
quadrupole: 12.3732 -0.0052 -0.0014
quadrupole: -13.1454 18.7209 -5.5755 12.3732 -0.0052 -0.0014
hfenergy: -708.4618842 hartree
pointgroup: C01 [X(C15H13N1O1)]
dipole: -2.0011734 0.2794552 0.0116009 debye
polarizability: 299.5803633|7.9124232|187.5131468|-1.5359662|-0.7175702|75.4049471 unknown
InChI: InChI=1S/C15H13NO/c1-10(17)11-7-8-15-13(9-11)12-5-3-4-6-14(12)16(15)2/h3-9H,1-2H3
charge 0 multiplicity 1
30 atoms
O  4.873568 0.077691 -0.033093
N  -1.405742 1.580059 -0.000509
C  0.029647 -0.234076 0.000075
C  -0.053917 1.205497 -0.007615
C  -1.339986 -0.736836 0.012136
C  -2.200191 0.414096 0.011367
C  1.291948 -0.858806 -0.004623
C  1.109837 2.011015 -0.020038
C  -1.912717 -2.029147 0.023537
C  2.467218 -0.063477 -0.016868
C  -3.605969 0.299757 0.021685
C  -1.941874 2.94027 -0.004899
C  2.35537 1.364449 -0.024456
C  -3.318975 -2.154333 0.034019
C  -4.153849 -1.002145 0.033084
C  3.840473 -0.659884 -0.022197
C  3.985558 -2.181533 -0.014162
H  1.360552 -1.951713 0.001202
H  1.056656 3.104439 -0.026136
H  -1.278736 -2.922819 0.024302
H  -4.256814 1.180195 0.020902
H  -1.115267 3.66632 -0.009605
H  -2.563557 3.116392 -0.902462
H  -2.559143 3.123372 0.894267
H  3.286995 1.93969 -0.03391
H  -3.77653 -3.149322 0.042975
H  -5.242454 -1.126506 0.041287
H  3.500814 -2.631539 -0.900657
H  3.512258 -2.621045 0.883707
H  5.055726 -2.437861 -0.019517
