program: Gaussian 09
title: 000274911
version: EM64L-G09RevD.01
frameworkgroup: C1[X(C16H20N2O2)]
method: RPBEPBE
basis: SDD
operation: Freq
keyword: #p
keyword: freq=noraman
keyword: PBEPBE/SDD
title: #p freq=noraman PBEPBE/SDD
converged: NO YES NO NO
title: Mulliken charges:
elementType: O O N N C C C C C C C C C C C C C C C C H H H H H H H H H H H H H H H H H H H H
charge: -0.265986 -0.267079 -0.095178 -0.160397 -0.013729 -0.241227 -0.444509 -0.475316 -0.399577 -0.452570 0.280777 -0.532324 -0.575204 0.161325 0.325966 -0.404270 -0.534563 -0.398473 0.326178 -0.536036 0.238613 0.245879 0.239728 0.199396 0.222612 0.241917 0.231228 0.258067 0.231806 0.231652 0.240267 0.247503 0.230765 0.232845 0.222951 0.258491 0.241945 0.220905 0.220400 0.245224
chargesum: 0.00000
title: Mulliken charges with hydrogens summed into heavy atoms:
elementType: O O N N C C C C C C C C C C C C C C C C
charge: -0.265986 -0.267079 -0.095178 -0.160397 0.224884 0.004652 -0.005385 -0.010787 0.089718 0.010887 0.280777 -0.044553 -0.111594 0.161325 0.325966 -0.181319 -0.276073 -0.156529 0.326178 0.150493
polarizability: 2.42720776e+02 -7.45340799e+00 1.80022416e+02 -8.22526270e+00 -9.43888769e+00 1.36702108e+02
1716.lowfreq: -9.5551 -1.6079 -0.0003 0.0005 0.0008 11.6170 30.6771 62.7585 70.8459
frequency: 30.6548 62.7375 70.8341 82.8455 93.3210 139.9963 157.6082 182.8734 219.7937 223.6183 239.2255 265.8735 312.0347 317.5923 327.9643 342.7936 378.4846 401.8461 438.2283 445.8729 484.6963 505.9897 520.1432 535.3673 548.3911 571.4431 593.3683 617.7623 639.5780 651.1087 699.3341 711.5545 725.4993 780.1172 811.8273 820.7976 852.1442 864.0318 870.3984 872.9503 891.8017 927.8525 935.8529 967.3000 984.0934 993.5340 1011.3467 1023.1418 1027.1756 1055.8482 1065.0164 1067.3655 1106.4877 1112.6024 1115.2337 1130.6463 1145.5137 1160.0253 1170.2298 1176.1189 1180.7005 1203.1559 1206.0409 1226.6004 1238.0888 1258.5706 1265.9413 1272.5140 1280.1915 1287.2123 1294.7054 1306.5617 1306.9281 1336.7008 1345.0230 1348.3924 1355.4187 1363.1658 1376.9215 1408.0882 1423.1080 1437.6723 1454.5383 1458.5733 1460.1582 1465.3598 1465.9468 1470.5240 1473.3309 1474.2700 1491.2362 1575.3209 1623.6882 1641.3845 2849.2784 2948.0548 2958.1941 2965.4543 2968.8568 2993.6111 3012.3789 3020.2815 3021.9226 3025.0415 3045.4498 3057.0667 3067.5973 3078.0523 3081.6295 3096.8257 3124.7344 3132.7730 3139.5207 3163.7138
redmass: 4.9883 4.2488 3.5823 4.0131 3.6184 2.2874 3.9191 3.5468 2.1599 1.4270 2.9960 2.7011 3.8922 3.4789 3.2878 2.8770 3.4652 3.7372 2.7176 3.6309 4.0838 3.7297 4.3731 3.7880 3.0532 3.1298 3.5525 4.0515 4.6211 2.7096 3.1496 4.8502 2.6262 2.1947 2.2058 1.9527 2.0378 3.7576 2.3426 2.2065 1.5743 2.3649 1.4676 2.9738 2.7067 2.9182 3.1381 2.2703 2.1086 2.4866 2.1980 2.1481 2.5571 1.2615 2.3305 2.5121 1.4524 1.5325 1.7874 1.7090 1.4272 1.2641 1.4969 1.4267 2.6211 1.8780 1.3847 1.4386 1.7841 1.3368 1.6118 1.6188 1.7067 1.3502 1.3886 1.2944 1.3686 1.4154 5.2204 2.7758 3.0945 1.2611 1.0952 1.1596 1.0899 1.0915 1.0506 1.0896 1.0765 1.0929 2.3433 6.9074 6.7804 10.7021 1.0811 1.0829 1.0331 1.0672 1.0637 1.0633 1.0627 1.0612 1.0650 1.0916 1.1039 1.1038 1.0942 1.1027 1.1003 1.1028 1.0990 1.0875 1.0915 1.0944
irintensity: 0.1787 4.2900 1.9522 2.4815 4.2512 1.2930 3.0694 1.4180 1.0776 1.1475 5.7407 2.6838 1.2798 3.8892 7.0637 1.1103 1.7376 2.1170 6.1255 6.0235 1.0209 2.0119 0.8579 6.3153 1.0568 4.5443 0.9815 15.1299 13.9690 7.0300 3.7904 0.6182 7.6842 9.4983 14.8662 26.7570 4.2249 1.7081 5.6292 11.0301 30.2852 9.5201 1.5942 9.1340 10.1355 27.8648 22.5115 12.8844 19.3149 2.4948 13.7994 4.6330 67.9377 0.0908 31.7033 23.9869 2.2606 24.2378 18.4907 50.7548 14.8017 14.5257 1.2304 9.7563 97.2448 96.6704 16.1427 11.3406 55.5189 4.6983 13.5836 20.4283 5.2020 36.6959 8.7931 21.6749 5.7876 16.4641 9.7026 112.0184 19.5220 2.7590 3.2512 6.4680 31.5872 26.5392 14.2609 14.4019 43.7384 13.0019 73.1459 33.7249 93.5319 418.4441 68.7156 24.1348 71.3395 36.7743 23.9475 38.7840 24.4285 38.9517 8.4979 50.5094 49.1367 37.3000 13.0430 33.9957 8.7156 25.0362 29.1118 12.5886 3.8447 16.4213
temp: 298.150 k
press: 1.00000 atm
elementType: 8 8 7 7 6 6 6 6 6 6 6 6 6 6 6 6 6 6 6 6 1 1 1 1 1 1 1 1 1 1 1 1 1 1 1 1 1 1 1 1
symmnumber: 1
zpe: 879281.3 jmol-1
zpe.correction: 0.334901 hartree
zpe.thermalcorrener: 0.351927 hartree
zpe.thermalcorrenthalpy: 0.352871 hartree
zpe.thermalcorrgfe: 0.290270 hartree
zpe.sumelectzpe: -880.163922 hartree
zpe.sumelectthermal: -880.146896 hartree
zpe.sumelectthermalent: -880.145952 hartree
zpe.sumelectthermalfe: -880.208553 hartree
dipole: 4.6413 1.9982 0.7409
dipole: 5.1072
quadrupole: -128.0745 -114.3393 -118.0641
quadrupole: -25.4677 -3.0101 -5.4490
quadrupole: -7.9152 5.8200 2.0952 -25.4677 -3.0101 -5.4490
hfenergy: -880.4988229 hartree
pointgroup: C01 [X(C16H20N2O2)]
dipole: 1.8455222 -0.769787 -0.1971165 debye
polarizability: 242.1518365|9.7353521|178.2868373|8.9023538|-13.0173926|139.006626 unknown
InChI: InChI=1S/C16H20N2O2/c1-20-12-2-3-13-11(10-12)6-8-17-14(13)7-9-18-15(17)4-5-16(18)19/h2-3,10,14-15H,4-9H2,1H3
charge 0 multiplicity 1
40 atoms
O  -4.430308 1.967366 0.67952
O  4.784997 0.082129 1.094839
N  -1.301222 -1.064574 -0.923826
N  -2.473539 0.749376 0.189745
C  -1.886093 -0.586261 0.363995
C  -0.367634 -0.076307 -1.561477
C  -1.123666 1.258747 -1.77859
C  -3.095785 -1.455502 0.819763
C  -1.696533 1.80857 -0.457224
C  -0.61625 -2.378082 -0.789122
C  0.984977 0.031377 -0.816981
C  -4.149165 -0.442723 1.340143
C  0.617465 -2.334053 0.151761
C  -3.752121 0.901075 0.707237
C  1.463268 -1.07584 -0.047781
C  1.820067 1.165912 -0.942994
C  2.730731 -1.004927 0.567446
C  3.08998 1.243071 -0.329227
C  3.546403 0.142122 0.434759
C  5.665139 1.247181 0.981594
H  -1.105771 -0.526727 1.164019
H  -0.155047 -0.492782 -2.569284
H  -1.958992 1.057723 -2.472923
H  -0.468304 2.009755 -2.253279
H  -2.810407 -2.202344 1.57874
H  -3.480402 -1.981992 -0.070994
H  -0.876702 2.142184 0.212199
H  -2.374985 2.66304 -0.623197
H  -0.299594 -2.676867 -1.806421
H  -1.33999 -3.135506 -0.438474
H  -4.120919 -0.329241 2.440052
H  -5.184321 -0.699749 1.063401
H  1.238846 -3.235849 -0.009588
H  0.287117 -2.378844 1.209554
H  1.484458 2.022854 -1.537002
H  3.109768 -1.844502 1.161092
H  3.697929 2.144206 -0.452757
H  5.190878 2.15376 1.405881
H  5.949765 1.436911 -0.071923
H  6.560264 0.989315 1.566324
