program: Gaussian 09
title: 000274912
version: EM64L-G09RevD.01
frameworkgroup: C1[X(C17H22N2O3)]
method: RPBEPBE
basis: SDD
operation: Freq
keyword: #p
keyword: freq=noraman
keyword: PBEPBE/SDD
title: #p freq=noraman PBEPBE/SDD
converged: YES YES NO NO
title: Mulliken charges:
elementType: O O O N N C C C C C C C C C C C C C C C C C H H H H H H H H H H H H H H H H H H H H H H
charge: -0.264906 -0.299875 -0.299498 -0.094318 -0.160804 -0.013278 -0.248920 -0.441133 -0.475916 -0.401554 -0.454140 0.327322 -0.532596 -0.579190 0.161725 0.353726 -0.575373 -0.547092 0.185058 0.194786 -0.530369 -0.530770 0.238406 0.249338 0.204974 0.241467 0.242052 0.222910 0.259429 0.231276 0.231911 0.233072 0.248017 0.240502 0.232113 0.229850 0.250503 0.258275 0.222529 0.253162 0.230514 0.222005 0.254955 0.229856
chargesum: 0.00000
title: Mulliken charges with hydrogens summed into heavy atoms:
elementType: O O O N N C C C C C C C C C C C C C C C C C
charge: -0.264906 -0.299875 -0.299498 -0.094318 -0.160804 0.225128 0.000419 0.005307 -0.010954 0.089152 0.010843 0.327322 -0.044077 -0.117228 0.161725 0.353726 -0.324870 -0.288818 0.185058 0.194786 0.175835 0.176046
polarizability: 2.62186068e+02 6.44209564e+00 1.99943127e+02 4.75360890e+00 -8.87902723e+00 1.46126548e+02
1716.lowfreq: -5.3357 -0.0006 -0.0003 0.0004 7.8907 14.1201 28.9845 47.3394 65.6486
frequency: 28.8601 47.3239 65.6251 73.0366 88.5266 112.2705 137.2986 144.1443 151.0053 163.7702 164.7796 197.7056 212.2653 242.0248 255.5954 272.1861 283.1051 309.8267 334.1631 365.8883 376.8304 394.3990 398.4080 429.8615 477.6336 489.2835 503.4214 517.5926 530.6581 555.3769 594.3169 609.4502 636.2703 645.7203 664.5836 703.0010 716.8376 729.0675 742.2035 793.3605 818.0998 854.5969 867.3533 871.9219 890.1022 894.0521 902.4055 930.7982 949.8364 961.1555 982.4150 998.4650 1022.4121 1026.6059 1053.8525 1056.1162 1070.3363 1085.1034 1108.0693 1114.4616 1116.0449 1128.9061 1143.5569 1149.5602 1159.0616 1164.6178 1167.4720 1178.7964 1197.5530 1206.9365 1217.9753 1241.4713 1260.7546 1263.9658 1270.8440 1275.5627 1281.1620 1291.4561 1304.9367 1308.0803 1333.2081 1344.0979 1348.3192 1355.3278 1364.4136 1364.9926 1382.9744 1408.4602 1424.6319 1443.3815 1455.1474 1457.5915 1458.2283 1460.1800 1461.7346 1463.7416 1470.2909 1475.4476 1477.3719 1487.3587 1487.9789 1559.5864 1613.7297 1641.8933 2848.8669 2951.7065 2963.1783 2965.7165 2971.3057 2973.1747 2993.9096 3012.9928 3020.7927 3021.4832 3022.7585 3058.9439 3067.2950 3067.9910 3069.7332 3079.4069 3081.8531 3096.9057 3120.7356 3121.5350 3136.2017 3153.9315
redmass: 4.9033 4.5430 3.4251 4.7274 3.8818 2.7956 3.0445 2.5220 2.4877 1.1528 1.1554 3.5705 3.2180 3.4657 3.7489 4.1017 3.0524 4.3590 2.7069 4.1685 4.2643 3.2529 4.3573 3.3421 4.6974 3.8851 4.1631 3.0419 3.7334 3.4817 3.7059 2.8229 4.8096 4.7437 4.4336 3.4202 5.6914 2.6674 3.3709 3.1594 2.4576 2.0993 2.1655 2.0632 2.9374 2.0821 1.5359 2.6667 5.2013 3.5038 2.6532 2.5360 2.3013 2.0194 3.3914 2.2637 2.0752 2.6804 2.7215 1.2402 1.2450 2.8321 1.8167 1.3576 1.5090 1.8600 1.5882 2.0639 1.2423 1.5213 1.3552 1.4190 1.5652 1.6522 2.1950 1.6648 1.7744 1.5050 1.6041 1.7332 1.5410 1.3753 1.3027 1.5295 1.5187 3.0697 3.1726 2.6792 1.1722 1.3113 1.0959 1.0571 1.1334 1.0725 1.0988 1.0975 1.0917 1.0947 1.0556 2.7035 1.0546 8.4573 7.0852 10.6856 1.0811 1.0828 1.0675 1.0634 1.0309 1.0312 1.0645 1.0626 1.0882 1.0616 1.0675 1.1034 1.0940 1.1036 1.1037 1.1030 1.1001 1.1029 1.1028 1.1028 1.0914 1.0901
irintensity: 0.1942 0.9079 2.9675 3.0256 3.1589 6.1488 2.7451 1.5208 3.2519 0.7199 0.7808 2.6024 6.0108 6.1256 6.6367 10.1766 1.0805 2.4721 1.4746 0.9213 1.0402 2.5278 1.8606 13.3644 4.2376 2.9301 2.0912 0.9429 2.7799 6.1414 2.1207 4.5796 2.3469 23.0506 1.9779 10.2725 14.5283 2.8812 6.2694 1.7686 6.2415 2.8709 20.0878 11.7051 12.3326 1.5550 24.3025 15.8057 63.9097 58.6276 7.1569 4.8594 20.7704 15.5212 20.4783 3.6617 5.2859 14.9929 64.9405 13.8292 3.9755 25.4508 3.7510 6.9353 17.1320 35.8148 27.9553 37.7236 15.1655 3.4982 8.1637 7.7282 20.3906 65.2276 94.9917 35.8879 61.8983 13.8038 6.7187 15.8783 48.7243 0.5830 17.8312 9.8514 29.6590 9.5251 7.9244 105.8185 0.2806 4.8209 6.3953 14.1714 11.4504 12.8394 19.7518 31.4274 19.0467 9.6448 6.2254 158.8783 15.1563 5.0728 2.7465 426.6122 68.9661 21.0218 38.3114 28.5927 86.9592 63.3695 34.8373 23.6229 26.6991 39.0711 34.3925 36.7591 11.6098 32.0545 22.1519 32.5925 8.3167 24.9638 24.0105 25.0755 7.2990 4.6740
temp: 298.150 k
press: 1.00000 atm
elementType: 8 8 8 7 7 6 6 6 6 6 6 6 6 6 6 6 6 6 6 6 6 6 1 1 1 1 1 1 1 1 1 1 1 1 1 1 1 1 1 1 1 1 1 1
symmnumber: 1
zpe: 959913.8 jmol-1
zpe.correction: 0.365612 hartree
zpe.thermalcorrener: 0.385628 hartree
zpe.thermalcorrenthalpy: 0.386572 hartree
zpe.thermalcorrgfe: 0.317349 hartree
zpe.sumelectzpe: -994.505485 hartree
zpe.sumelectthermal: -994.485469 hartree
zpe.sumelectthermalent: -994.484524 hartree
zpe.sumelectthermalfe: -994.553748 hartree
dipole: -3.9100 3.6296 0.1189
dipole: 5.3363
quadrupole: -139.7396 -128.3533 -130.2287
quadrupole: 20.0984 1.3731 -1.4950
quadrupole: -6.9657 4.4206 2.5451 20.0984 1.3731 -1.4950
hfenergy: -994.8710969 hartree
pointgroup: C01 [X(C17H22N2O3)]
dipole: 1.5783856 -1.3841443 -0.0234956 debye
polarizability: 261.5850196|8.5384629|199.7379409|-6.5755623|10.347185|146.9327823 unknown
InChI: InChI=1S/C17H22N2O3/c1-21-14-9-11-5-7-18-13(12(11)10-15(14)22-2)6-8-19-16(18)3-4-17(19)20/h9-10,13,16H,3-8H2,1-2H3
charge 0 multiplicity 1
44 atoms
O  -4.682543 2.150919 -0.572297
O  3.631815 1.877527 0.390977
O  4.364123 -0.483668 -1.201138
N  -1.784707 -1.149115 0.939656
N  -2.826768 0.767122 -0.133313
C  -2.358735 -0.611606 -0.329488
C  -0.751898 -0.249928 1.554888
C  -1.38099 1.145155 1.797839
C  -3.64839 -1.371828 -0.759917
C  -1.94579 1.751669 0.497768
C  -1.225093 -2.518202 0.778501
C  0.585429 -0.259973 0.775522
C  -4.623152 -0.269808 -1.250954
C  -0.017334 -2.575085 -0.196141
C  -4.099111 1.03095 -0.620635
C  0.93843 -1.39809 -0.010115
C  1.511769 0.806601 0.878767
C  2.203329 -1.43616 -0.644558
C  2.760379 0.773441 0.227063
C  3.125166 -0.379049 -0.525345
C  3.950301 2.600691 -0.863058
C  5.552868 -0.470502 -0.315532
H  -1.595792 -0.612064 -1.148394
H  -0.546063 -0.687132 2.5551
H  -0.64698 1.832503 2.252708
H  -2.207275 1.01445 2.519017
H  -4.05596 -1.868604 0.137761
H  -3.445333 -2.136205 -1.527872
H  -2.545404 2.657882 0.690641
H  -1.121635 2.024131 -0.193946
H  -2.02325 -3.203837 0.442344
H  -0.909484 -2.853872 1.784538
H  -5.669852 -0.439995 -0.951597
H  -4.610467 -0.151481 -2.350609
H  -0.379577 -2.583874 -1.244627
H  0.525854 -3.529708 -0.056529
H  1.286848 1.703906 1.463577
H  2.501415 -2.308226 -1.238224
H  3.033288 3.058981 -1.279747
H  4.401052 1.921223 -1.608799
H  4.664045 3.387305 -0.57459
H  5.551289 -1.367331 0.332709
H  5.57291 0.441504 0.307823
H  6.421273 -0.498014 -0.991178
