program: Gaussian 09
title: 000274887
version: EM64L-G09RevD.01
frameworkgroup: C1[X(C12H14O4)]
method: RPBEPBE
basis: SDD
operation: Freq
keyword: #pfreq=noraman
keyword: PBEPBE/SDD
title: #p freq=noraman PBEPBE/SDD
converged: YES YES NO NO
title: Mulliken charges:
elementType: O O O O C C C C C C C C C C C C H H H H H H H H H H H H H H
charge: -0.250944 -0.277031 -0.198138 -0.185483 -0.607207 0.290340 -0.281835 0.226863 -0.248209 -0.245416 0.324400 -0.685619 -0.755412 -0.281641 -0.331192 0.111164 0.237622 0.264905 0.225337 0.224432 0.223427 0.257898 0.219443 0.234992 0.228811 0.255294 0.254048 0.242520 0.255066 0.271565
chargesum: 0.00000
title: Mulliken charges with hydrogens summed into heavy atoms:
elementType: O O O O C C C C C C C C C C C C
charge: -0.250944 -0.277031 -0.198138 -0.185483 -0.104680 0.290340 -0.056499 0.226863 0.199650 0.012482 0.324400 -0.002373 -0.003549 -0.026575 -0.059627 0.111164
polarizability: 3.31928519e+02 -1.78092956e+01 1.49529212e+02 1.21482261e+01 4.01753249e+00 8.71605369e+01
1716.lowfreq: -9.4832 -6.3718 -0.0011 -0.0003 0.0004 2.1926 17.2054 28.2902 41.8733
frequency: 17.1382 28.1157 41.8341 50.5450 72.2479 85.2269 113.7234 129.3565 141.9915 147.7729 193.7467 228.8362 249.5258 258.8078 296.3583 325.4665 340.4609 383.4719 431.9068 464.7661 509.2454 521.6202 562.0133 590.1181 643.1272 676.4720 691.6980 734.3615 781.5516 783.2684 793.7551 797.8047 833.1743 856.3717 883.0466 894.2565 901.1724 922.1749 946.0005 1001.7977 1020.0662 1034.4882 1041.9385 1070.0962 1111.9663 1126.5367 1132.3441 1157.3722 1180.3867 1221.4192 1227.7811 1260.1075 1264.2559 1286.1494 1336.2942 1371.6519 1380.0690 1402.0175 1407.8163 1440.8601 1450.3351 1450.7694 1462.9162 1478.3927 1490.1013 1517.9698 1598.7218 1625.6726 1639.1617 1699.4673 2981.6964 2983.2612 2999.1005 3028.7301 3050.3594 3069.4583 3097.2714 3106.4861 3108.7536 3120.4348 3126.2643 3185.4628 3204.0762 3238.4797
redmass: 4.3978 4.0766 5.3467 5.6041 4.4590 4.0641 1.0888 5.1356 2.1991 2.6331 4.0931 4.0907 1.3970 5.3624 4.2118 2.7843 4.0123 2.5894 2.9536 4.6548 3.0652 4.1607 3.7772 4.0320 6.0888 5.0783 4.9742 5.9812 4.8021 3.7256 4.2563 1.5149 1.1937 1.5226 2.1234 2.9276 1.3411 1.3307 3.3208 1.8295 1.8142 2.8294 1.9939 1.7201 2.3974 1.5058 1.4086 2.7881 2.7394 2.4563 2.0045 1.2246 1.2912 1.5987 1.3479 1.2521 1.6184 1.3476 1.8743 1.0746 1.0766 1.0659 1.0396 1.0499 1.0902 6.1398 8.6002 6.2619 8.0741 12.1461 1.0553 1.0385 1.0366 1.0586 1.1083 1.0933 1.0989 1.1043 1.1020 1.0883 1.1014 1.0876 1.0927 1.1047
irintensity: 1.0978 5.9889 7.1268 1.8507 1.6982 1.1963 0.0069 1.1291 2.5017 1.4686 2.8036 1.0457 2.1869 0.4947 0.9886 7.0585 3.5219 1.4248 2.6168 4.6363 12.3855 6.5849 3.6954 4.6707 9.2872 7.5748 1.0733 8.3895 64.4959 57.2363 4.9939 69.4851 5.4802 6.4930 0.6700 12.9923 23.8601 0.6261 121.6213 7.6136 4.5265 90.0407 31.9169 6.8694 31.2261 33.2283 5.2472 88.7491 93.5432 80.2240 253.9243 7.3920 18.8634 21.1043 111.9467 89.1370 52.0271 114.7897 91.7403 22.2801 7.3508 21.0343 14.2164 9.8345 6.2829 196.5936 113.2148 359.9500 182.2954 644.0458 18.1215 3.3803 18.8760 14.2395 15.3583 8.1200 18.6251 6.9845 33.3886 4.3788 10.9101 8.8672 1.0603 0.3413
temp: 298.150 k
press: 1.00000 atm
elementType: 8 8 8 8 6 6 6 6 6 6 6 6 6 6 6 6 1 1 1 1 1 1 1 1 1 1 1 1 1 1
symmnumber: 1
zpe: 613153.7 jmol-1
zpe.correction: 0.233538 hartree
zpe.thermalcorrener: 0.250579 hartree
zpe.thermalcorrenthalpy: 0.251523 hartree
zpe.thermalcorrgfe: 0.185700 hartree
zpe.sumelectzpe: -765.330347 hartree
zpe.sumelectthermal: -765.313306 hartree
zpe.sumelectthermalent: -765.312362 hartree
zpe.sumelectthermalfe: -765.378185 hartree
dipole: -6.8556 1.2417 -1.0308
dipole: 7.0430
quadrupole: -116.4760 -94.6093 -93.8605
quadrupole: -19.7408 -5.5621 3.0669
quadrupole: -14.8274 7.0393 7.7881 -19.7408 -5.5621 3.0669
hfenergy: -765.5638852 hartree
pointgroup: C01 [X(C12H14O4)]
dipole: -2.6647656 0.6036577 -0.4611574 debye
polarizability: 329.4349935|-24.2546137|148.3794967|21.1520127|10.808893|90.8037777 unknown
InChI: InChI=1S/C12H14O4/c1-3-15-11(8-9(2)13)5-4-10-6-7-12(14)16-10/h4-7H,3,8H2,1-2H3
charge 0 multiplicity 1
30 atoms
O  -2.418752 1.31321 -0.610681
O  3.034491 0.650778 0.210692
O  -2.807129 -3.046328 -0.499035
O  5.341197 0.252539 0.559741
C  -2.819796 -0.839241 -1.538085
C  -1.788242 0.124222 -0.968911
C  -0.46408 -0.265335 -0.838141
C  -3.246435 -1.868766 -0.463203
C  -1.694699 2.433741 0.045247
C  0.697429 0.430752 -0.34783
C  1.957634 -0.135748 -0.275538
C  -2.735655 3.507323 0.342995
C  -4.199202 -1.374694 0.612798
C  2.45829 -1.457851 -0.607863
C  3.810322 -1.498933 -0.339037
C  4.243271 -0.191803 0.183527
H  -3.696994 -0.257076 -1.869944
H  -2.400303 -1.39597 -2.391196
H  -0.295572 -1.294081 -1.180995
H  -1.216696 2.060603 0.971145
H  -0.917281 2.807137 -0.648015
H  0.637673 1.468709 -0.012951
H  -2.250385 4.375226 0.824719
H  -3.22062 3.851247 -0.586175
H  -3.514897 3.123458 1.023282
H  -4.232538 -2.082738 1.454994
H  -3.910733 -0.367669 0.962293
H  -5.217025 -1.284598 0.184462
H  1.845629 -2.27051 -0.998075
H  4.499195 -2.331707 -0.46792
