program: Gaussian 09
title: 000274870
version: EM64L-G09RevD.01
frameworkgroup: C1[X(C16H13NO2)]
method: RPBEPBE
basis: SDD
operation: Freq
keyword: #p
keyword: freq=noraman
keyword: PBEPBE/SDD
title: #p freq=noraman PBEPBE/SDD
converged: YES YES NO NO
title: Mulliken charges:
elementType: O O N C C C C C C C C C C C C C C C C H H H H H H H H H H H H H
charge: -0.250316 -0.227879 -0.290031 0.235436 0.161169 0.190742 0.212162 -0.453084 -0.396912 -0.396281 0.379440 -0.279759 0.201670 -0.397167 -0.239736 -0.262127 0.097975 -0.793915 -0.790856 0.322489 0.240481 0.242934 0.246561 0.280122 0.233137 0.228986 0.244640 0.244413 0.268451 0.244137 0.244130 0.258985
chargesum: 0.00000
title: Mulliken charges with hydrogens summed into heavy atoms:
elementType: O O N C C C C C C C C C C C C C C C C
charge: -0.250316 -0.227879 -0.290031 0.235436 0.161169 0.190742 0.212162 -0.130595 -0.156430 -0.153347 0.379440 -0.033198 0.201670 -0.117044 -0.006600 -0.033140 0.097975 -0.036410 -0.043603
polarizability: 3.13254291e+02 7.77761815e+00 2.11981305e+02 9.31328278e-02 -1.49556067e-01 7.99736961e+01
1716.lowfreq: -3.9968 -0.0010 -0.0008 -0.0007 5.0984 7.9463 43.0822 57.7567 59.9901
frequency: 43.0349 57.7167 59.9557 92.8326 119.5255 142.8202 152.9131 178.6331 216.0125 236.2657 279.2833 309.7818 320.8386 341.7996 342.9617 388.6710 417.9546 429.6454 460.6113 505.7775 528.0086 545.7392 559.8510 582.5244 593.1237 594.1991 640.5480 666.5461 676.3116 718.9988 742.2624 757.2247 784.0308 794.5230 856.7236 870.4286 917.4046 936.1743 946.5218 948.9485 965.7702 985.1049 994.5836 994.8579 1013.5759 1027.9521 1037.9029 1039.2719 1070.7146 1116.8357 1131.9668 1173.3714 1176.1229 1208.7001 1231.8214 1285.5181 1290.8437 1311.2300 1332.1118 1370.9160 1386.5263 1397.3168 1400.2027 1434.7641 1443.4813 1447.5697 1455.4578 1462.4898 1469.5677 1475.8571 1494.7273 1569.6659 1586.8846 1601.4501 1605.3541 1614.1243 1628.4004 2986.9191 2995.9242 3070.5465 3087.2710 3124.4744 3133.4409 3135.4797 3140.3776 3146.3375 3164.8473 3167.1260 3214.0918 3217.0110
redmass: 3.3051 7.1141 3.8881 5.2759 5.2514 3.4285 1.0974 4.7921 5.0179 4.6294 1.1311 6.8358 4.3910 3.8027 4.3962 8.7694 3.7501 3.1131 3.0928 6.6629 3.3170 4.7561 3.2829 4.5248 3.4220 4.3228 6.2527 3.3031 5.8095 5.6971 2.6100 1.6978 6.2160 2.8726 1.3612 1.6265 4.0198 1.4018 1.3986 2.0448 7.3134 1.3253 1.3529 6.5018 1.9540 1.8341 2.0284 1.6586 1.8736 1.8801 1.5893 2.2003 1.2650 2.0308 1.7658 2.9825 1.8074 3.2505 2.5484 1.2904 1.2453 4.2765 6.2174 5.4850 1.8744 1.2063 2.4289 1.0487 1.2740 1.0481 3.7189 7.4442 6.8005 8.0907 7.2282 7.9056 7.5868 1.0375 1.0379 1.0966 1.0988 1.0995 1.0982 1.0863 1.0888 1.0917 1.0962 1.0990 1.0928 1.0923
irintensity: 1.3927 0.5179 8.6818 0.4966 2.1347 0.9859 1.0088 0.9375 1.3132 5.6612 1.7631 2.0249 0.0768 5.5909 2.7051 2.1707 0.1365 7.5879 0.1906 9.7095 2.3340 3.0192 1.0429 17.2876 2.7702 23.8915 5.6964 4.0611 4.6332 1.7434 37.3230 57.2726 0.0736 9.9470 32.0444 3.9744 12.8310 23.6456 1.6208 24.3728 4.6781 0.0468 0.7217 5.4875 24.8043 0.4082 8.7119 5.7112 3.9448 8.2953 4.7235 10.0285 6.1758 50.6832 198.5005 176.8270 75.3767 130.7042 213.6270 39.2393 50.4561 56.1201 30.1950 85.2813 40.1835 29.9161 28.8443 20.2718 5.1322 20.9800 31.2504 177.8039 31.6486 61.1146 113.7610 54.3862 2.2861 2.4744 2.5358 10.5730 8.1389 22.0170 8.2473 1.3550 3.4627 12.5687 3.3885 30.5385 11.4057 4.2876
temp: 298.150 k
press: 1.00000 atm
elementType: 8 8 7 6 6 6 6 6 6 6 6 6 6 6 6 6 6 6 6 1 1 1 1 1 1 1 1 1 1 1 1 1
symmnumber: 1
zpe: 649416.7 jmol-1
zpe.correction: 0.247350 hartree
zpe.thermalcorrener: 0.263205 hartree
zpe.thermalcorrenthalpy: 0.264149 hartree
zpe.thermalcorrgfe: 0.203913 hartree
zpe.sumelectzpe: -821.425501 hartree
zpe.sumelectthermal: -821.409647 hartree
zpe.sumelectthermalent: -821.408702 hartree
zpe.sumelectthermalfe: -821.468938 hartree
dipole: -6.1676 0.6973 0.0034
dipole: 6.2069
quadrupole: -112.6276 -103.6503 -113.7326
quadrupole: 5.4014 -0.0207 0.0182
quadrupole: -2.6241 6.3532 -3.7291 5.4014 -0.0207 0.0182
hfenergy: -821.6728511 hartree
pointgroup: C01 [X(C16H13N1O2)]
dipole: -2.3932234 0.4788774 0.0804981 debye
polarizability: 313.834711|-1.1781697|207.8913456|-0.0397693|21.1883679|83.4832353 unknown
InChI: InChI=1S/C16H13NO2/c1-10(18)12-7-8-14-13-5-3-4-6-15(13)17(11(2)19)16(14)9-12/h3-9H,1-2H3
charge 0 multiplicity 1
32 atoms
O  0.642817 2.70062 0.388414
O  4.897877 -1.809685 -0.356574
N  -0.710328 0.831588 0.077634
C  0.388321 -0.092525 -0.075396
C  -0.141983 -1.401482 -0.291076
C  -1.593894 -1.297958 -0.274325
C  -1.934664 0.077653 -0.048447
C  1.776604 0.139081 -0.037239
C  0.729492 -2.500479 -0.471957
C  -2.599283 -2.275574 -0.436423
C  2.643362 -0.971841 -0.21951
C  -3.290452 0.469273 0.011708
C  -0.52269 2.220359 0.312636
C  2.115411 -2.280146 -0.435117
C  -3.951419 -1.882651 -0.374942
C  -4.284635 -0.522523 -0.153484
C  4.138814 -0.808213 -0.192508
C  -1.741385 3.111968 0.472879
C  4.727097 0.580037 0.033994
H  2.158049 1.145471 0.127294
H  0.329558 -3.506273 -0.638353
H  -2.329786 -3.323117 -0.607821
H  -3.605612 1.497913 0.178739
H  2.829475 -3.098794 -0.570007
H  -4.746845 -2.624712 -0.498271
H  -5.337893 -0.224764 -0.107996
H  -2.36884 2.800377 1.326538
H  -2.365882 3.119837 -0.438069
H  -1.372736 4.131393 0.65733
H  4.399539 0.999532 1.003382
H  4.400262 1.285341 -0.75262
H  5.825248 0.509695 0.023087
