program: Gaussian 09
title: 000274872
version: EM64L-G09RevD.01
frameworkgroup: C1[X(C16H15NO)]
method: RPBEPBE
basis: SDD
operation: Freq
keyword: #p
keyword: freq=noraman
keyword: PBEPBE/SDD
title: #p freq=noraman PBEPBE/SDD
converged: YES YES NO NO
title: Mulliken charges:
elementType: O N C C C C C C C C C C C C C C C C H H H H H H H H H H H H H H H
charge: -0.229046 -0.251150 0.246646 0.183968 0.227945 0.199149 -0.391596 -0.504811 -0.397316 -0.369612 -0.394336 0.370037 -0.402576 -0.660982 -0.225617 -0.253799 0.091896 -0.794945 0.226132 0.223566 0.246462 0.239152 0.234907 0.238289 0.275981 0.233149 0.219694 0.235420 0.224292 0.226065 0.236013 0.234615 0.262410
chargesum: 0.00000
title: Mulliken charges with hydrogens summed into heavy atoms:
elementType: O N C C C C C C C C C C C C C C C C
charge: -0.229046 -0.251150 0.246646 0.183968 0.227945 0.199149 0.058102 -0.258349 -0.158165 -0.134705 -0.156047 0.370037 -0.126596 0.027281 -0.001325 -0.027733 0.091896 -0.061907
polarizability: 3.22025312e+02 -2.55743854e+00 1.93369066e+02 -1.80603793e+00 -9.20999609e+00 8.68783002e+01
1716.lowfreq: -7.6074 -0.0008 -0.0005 0.0002 4.1095 4.5211 47.8620 51.7743 61.8899
frequency: 47.8226 51.7266 61.8882 79.1226 129.3963 142.9227 147.0335 176.2301 192.1581 221.3242 262.4586 288.8111 314.3629 317.5773 403.4654 414.5946 427.5827 454.1461 499.0768 534.0972 542.4847 570.8117 574.1047 585.9413 601.8654 656.8569 672.5629 721.9812 734.9893 753.7142 772.3679 780.9201 801.0532 849.9070 858.5531 870.6442 910.5288 938.4154 939.6039 945.9200 975.6445 986.2470 988.9558 1018.3736 1025.4300 1053.2422 1070.2095 1086.0852 1127.0004 1135.4368 1139.3391 1171.0837 1223.3660 1238.2118 1261.5966 1284.7298 1303.9409 1338.3718 1342.6056 1357.2747 1367.2346 1391.7310 1396.4224 1406.3807 1447.4401 1453.2575 1458.0610 1464.5629 1466.6890 1471.6704 1480.2235 1492.7001 1494.1977 1560.2928 1584.3315 1594.4530 1611.5354 1636.5904 2983.9404 2989.8189 3005.9668 3055.3177 3069.0732 3088.5329 3097.7664 3123.4778 3128.2271 3136.2890 3138.7491 3149.4876 3149.9823 3166.2800 3167.1497
redmass: 2.7434 3.4376 6.9300 3.6713 4.1990 1.9441 1.4201 4.6601 1.2021 3.4928 3.9616 2.1677 5.8871 5.0370 3.9803 3.4702 3.1831 2.9836 6.0688 3.8639 4.1789 4.0986 4.4570 3.8965 4.3958 3.1301 5.2456 5.3389 2.5050 1.7189 1.8929 2.7773 2.1624 1.3431 1.6295 1.5466 3.2183 1.4904 2.1852 2.0676 1.3154 1.3391 7.2541 2.0364 1.8293 2.8088 2.3567 2.0074 1.6832 1.6413 1.4008 1.0979 1.9625 1.9173 2.4586 1.4430 1.8019 1.9101 1.7846 1.7602 1.3571 1.6294 2.5629 4.5471 1.1454 2.9416 3.1494 1.0502 1.2127 2.6917 1.0826 1.2167 3.0060 7.2991 6.8879 7.8649 7.2933 7.6719 1.0373 1.0357 1.0604 1.1029 1.0972 1.0995 1.1019 1.0990 1.0850 1.0891 1.0891 1.0944 1.0915 1.0996 1.0959
irintensity: 0.0788 2.3221 0.5941 3.1424 1.1579 0.1866 1.6162 0.3937 0.3104 3.1921 1.5578 3.0768 2.0080 0.1198 5.8134 0.2202 4.9733 0.9744 10.0588 2.9874 1.5044 2.3549 10.0600 3.8611 4.1246 5.4075 8.3935 3.3667 33.2466 65.2002 5.6705 10.7058 2.9304 22.0591 13.9049 22.2036 8.2003 4.6227 27.8405 9.7099 0.0148 1.1018 9.8394 6.1790 1.1017 6.0876 2.4735 7.8407 1.3241 15.3400 2.7974 7.1254 29.0337 60.6659 210.9223 59.2703 39.4092 119.0577 50.4046 8.1528 71.3783 22.8742 3.8793 13.3830 29.9847 55.2661 20.3343 20.2981 32.6955 18.2179 2.3541 13.8698 58.4120 160.7963 19.9316 79.7661 27.9908 38.5689 4.7284 22.2255 37.3674 3.9414 14.4577 42.3113 24.8253 20.8457 0.6241 4.0417 5.4300 16.8985 22.6514 27.3939 13.4235
temp: 298.150 k
press: 1.00000 atm
elementType: 8 7 6 6 6 6 6 6 6 6 6 6 6 6 6 6 6 6 1 1 1 1 1 1 1 1 1 1 1 1 1 1 1
symmnumber: 1
zpe: 697446.8 jmol-1
zpe.correction: 0.265643 hartree
zpe.thermalcorrener: 0.281289 hartree
zpe.thermalcorrenthalpy: 0.282233 hartree
zpe.thermalcorrgfe: 0.222370 hartree
zpe.sumelectzpe: -747.448303 hartree
zpe.sumelectthermal: -747.432658 hartree
zpe.sumelectthermalent: -747.431714 hartree
zpe.sumelectthermalfe: -747.491577 hartree
dipole: 3.7194 4.1961 -0.3890
dipole: 5.6207
quadrupole: -117.0718 -91.2218 -110.3176
quadrupole: -10.5148 1.4406 -2.3231
quadrupole: -10.8681 14.9819 -4.1139 -10.5148 1.4406 -2.3231
hfenergy: -747.713947 hartree
pointgroup: C01 [X(C16H15N1O1)]
dipole: 1.4607711 1.6532533 -0.1517594 debye
polarizability: 322.0288651|-2.3747105|193.3917059|-2.0220534|-9.0361172|86.8521077 unknown
InChI: InChI=1S/C16H15NO/c1-3-17-15-7-5-4-6-13(15)14-9-8-12(11(2)18)10-16(14)17/h4-10H,3H2,1-2H3
charge 0 multiplicity 1
33 atoms
O  -4.867542 -1.088097 0.128827
N  0.859963 1.199701 -0.270389
C  -0.256436 0.350486 -0.134118
C  0.205239 -1.00373 0.036844
C  2.028648 0.421946 -0.166946
C  1.658449 -0.958031 0.015646
C  0.814675 2.660254 -0.420599
C  -1.627006 0.670907 -0.152608
C  -0.743573 -2.045023 0.183736
C  3.381143 0.824964 -0.224914
C  2.668263 -1.942458 0.13378
C  -2.564913 -0.385427 -0.0044
C  -2.112453 -1.733166 0.162002
C  0.812042 3.411053 0.92999
C  4.368352 -0.176447 -0.104709
C  4.019915 -1.546204 0.072163
C  -4.044318 -0.134038 -0.012604
C  -4.554879 1.29488 -0.197799
H  1.683531 2.970625 -1.029185
H  -0.086921 2.919864 -1.005105
H  -1.965926 1.704417 -0.273263
H  -0.415055 -3.081947 0.312941
H  3.667125 1.873919 -0.35479
H  2.405409 -2.997023 0.271823
H  -2.875896 -2.509349 0.273488
H  -0.0636 3.126034 1.539136
H  0.776716 4.502839 0.761437
H  1.721439 3.179774 1.51162
H  5.426118 0.106949 -0.146141
H  4.813648 -2.295229 0.162776
H  -4.21846 1.714738 -1.164218
H  -4.183183 1.959824 0.604067
H  -5.655012 1.284796 -0.174087
