program: Gaussian 09
title: 000274851
version: EM64L-G09RevD.01
frameworkgroup: C1[X(C9H8N6O2)]
method: RPBEPBE
basis: SDD
operation: Freq
keyword: #pfreq=noraman
keyword: PBEPBE/SDD
title: #p freq=noraman PBEPBE/SDD
converged: YES YES NO YES
title: Mulliken charges:
elementType: O O N N N N N N C C C C C C C C C H H H H H H H H
charge: -0.208769 -0.208770 -0.126912 -0.126912 0.025004 -0.110251 -0.578230 -0.578229 0.319994 0.042767 -0.329785 -0.329785 0.386687 -0.364673 -0.364673 0.030141 0.030141 0.285792 0.285792 0.285331 0.285332 0.337529 0.337475 0.337529 0.337475
chargesum: 0.00000
title: Mulliken charges with hydrogens summed into heavy atoms:
elementType: O O N N N N N N C C C C C C C C C
charge: -0.208769 -0.208770 -0.126912 -0.126912 0.025004 -0.110251 0.096774 0.096775 0.319994 0.042767 -0.043993 -0.043993 0.386687 -0.079341 -0.079341 0.030141 0.030141
polarizability: 2.68387037e+02 4.45652497e-06 1.73500075e+02 1.83564583e-04 -9.72107494e-03 5.75507348e+01
1716.lowfreq: -4.9287 -4.3540 0.0005 0.0008 0.0010 7.8684 35.0269 49.8405 69.1812
frequency: 35.0049 49.8402 69.1705 90.7426 142.5460 183.3180 186.7856 221.1579 224.6919 289.0140 324.4535 350.4488 411.6745 463.5560 467.9299 496.5732 502.0371 513.0649 525.6387 553.8589 554.5954 566.7383 596.8326 627.1610 656.9070 684.5161 686.7126 716.9008 760.3823 785.6855 811.4921 865.7800 867.3128 893.1526 909.7353 986.9889 987.6048 1007.2532 1010.8436 1015.4787 1091.4056 1102.7183 1131.3608 1161.4007 1177.5712 1217.7591 1257.0264 1288.5297 1360.0045 1372.0414 1390.8142 1409.4931 1430.9315 1468.2748 1483.7183 1516.2552 1523.9881 1594.4253 1601.0474 1610.2673 1630.2300 3170.0902 3170.4774 3186.7807 3190.2360 3552.7777 3554.6450 3712.4715 3712.7324
redmass: 6.3427 8.2744 5.7905 6.6798 8.4058 7.9195 5.7053 7.3921 7.8845 7.0660 3.0389 4.0523 2.9259 8.1394 3.4303 5.7536 1.1979 1.2704 4.2606 1.0296 1.0672 6.8395 7.1280 7.1662 6.1356 8.3525 4.3107 11.5720 5.3165 9.3459 8.4980 1.2413 5.2800 1.7114 9.0377 3.7944 2.3416 2.5992 1.3386 1.3604 3.4347 1.2788 2.4249 1.7120 1.9296 8.1072 5.8603 1.2778 6.8571 4.6796 6.3104 6.6493 4.9557 4.4431 3.4216 2.0221 4.3129 6.7336 1.5389 6.0393 2.0967 1.0886 1.0891 1.0959 1.0972 1.0442 1.0447 1.1058 1.1058
irintensity: 0.0000 0.0524 0.0000 0.0435 6.5317 0.0000 14.5646 4.9152 0.4634 0.6536 9.1757 1.4898 0.0000 13.7984 7.1805 0.0235 0.0001 563.9565 2.3483 0.0002 35.5817 2.8717 5.4879 0.1334 15.6046 4.7717 15.2492 0.0000 4.7457 39.1145 54.2059 0.0000 2.9374 54.6644 15.9849 0.4518 1.7080 9.7897 0.0405 0.0000 24.1261 20.5489 0.4709 0.3889 7.0175 488.0399 9.1854 0.0049 82.1058 128.0235 40.5606 18.7177 0.0286 375.3059 232.6198 79.3255 535.6820 14.6619 663.6060 4.0153 330.4717 0.8170 1.5740 0.0007 0.0469 161.2870 88.1554 23.6794 76.7131
temp: 298.150 k
press: 1.00000 atm
elementType: 8 8 7 7 7 7 7 7 6 6 6 6 6 6 6 6 6 1 1 1 1 1 1 1 1
symmnumber: 1
zpe: 467518.9 jmol-1
zpe.correction: 0.178069 hartree
zpe.thermalcorrener: 0.192101 hartree
zpe.thermalcorrenthalpy: 0.193045 hartree
zpe.thermalcorrgfe: 0.136162 hartree
zpe.sumelectzpe: -825.476925 hartree
zpe.sumelectthermal: -825.462893 hartree
zpe.sumelectthermalent: -825.461949 hartree
zpe.sumelectthermalfe: -825.518832 hartree
dipole: 8.1917 0.0000 0.0001
dipole: 8.1917
quadrupole: -109.6995 -77.5351 -100.1590
quadrupole: 0.0000 -0.0001 0.0003
quadrupole: -13.9017 18.2628 -4.3611 0.0000 -0.0001 0.0003
hfenergy: -825.654994 hartree
pointgroup: C01 [X(C9H8N6O2)]
dipole: -3.2228686 -0.0000903 0.0000552 debye
dipolederiv: -0.8395651 -0.2030412 0.004764 -0.2783288 -0.6622024 0.0101564 0.0064467 0.0100943 -0.2314193 -0.8395912 0.2030306 -0.0047585 0.278319 -0.6621765 0.0101671 -0.0064187 0.0100696 -0.2314193 -1.5640229 0.5502946 -0.013015 0.2819252 -0.8352844 0.0152018 -0.0068873 0.0151702 -0.1922119 -1.563976 -0.5503343 0.0130377 -0.2819666 -0.835332 0.0152043 0.0069051 0.0151808 -0.1922121 2.1198699 0.0000289 -0.0000156 0.0000293 1.0858066 -0.0211757 -0.000017 -0.0209688 0.1924413 -0.7089708 0.0000188 -0.0000002 0.0000198 -1.4195114 0.0275286 0.0000053 0.0275968 -0.2602456 -0.6786395 0.603446 -0.0142722 0.7509864 -1.1833634 0.0113727 -0.0177967 0.0113674 -0.7047764 -0.6785637 -0.6034171 0.0142704 -0.7509582 -1.1834395 0.0113841 0.0178022 0.0113858 -0.7047766 -0.0761334 -0.0000046 0.0000006 -0.0000053 0.0878111 -0.0022448 -0.0000015 -0.0022071 -0.0115746 1.6082669 0.0000177 -0.0000089 0.000018 0.973635 -0.0210565 -0.0000065 -0.0209038 0.0814953 -0.2563714 -0.1770686 0.0039854 -0.1129445 -0.0140722 -0.0021596 0.0025498 -0.0022245 -0.1097605 -0.2563885 0.1770553 -0.0039821 0.1129317 -0.0140564 -0.0021609 -0.0025502 -0.002224 -0.1097606 -0.8959883 -0.0000266 0.0000102 -0.0000285 0.0895142 -0.0004889 0.0000025 -0.0005882 0.0601112 0.1658872 0.1600781 -0.0035951 -0.1241581 -0.0358471 -0.0017001 0.0030377 -0.0017214 -0.1122569 0.1658902 -0.1600676 0.003593 0.1241697 -0.0358497 -0.0017036 -0.0030547 -0.0017194 -0.1122568 1.5006951 -0.6100657 0.0145213 -0.7188929 1.7514755 -0.0361228 0.017413 -0.0361972 0.2315439 1.5006202 0.6100511 -0.0145427 0.7188791 1.7515491 -0.0361422 -0.0174426 -0.0362213 0.231545 0.1421936 0.0650877 -0.0014659 0.0643973 0.0275348 0.002699 -0.0014669 0.002724 0.1476072 0.1422008 -0.0650811 0.0014658 -0.0643908 0.0275277 0.0026996 0.0014705 0.0027236 0.1476072 0.0870466 -0.0575157 0.0012827 -0.0289878 0.0555528 0.0025342 0.0005711 0.0025999 0.1693697 0.0870423 0.0575176 -0.0012827 0.0289894 0.055558 0.0025345 -0.0005705 0.0025986 0.1693697 0.167116 -0.0143394 0.0003091 -0.0746553 0.2845842 0.0023651 0.0017235 0.0023835 0.3839378 0.2521388 -0.0796386 0.0018685 -0.049704 0.2029943 0.0043701 0.0011738 0.0043468 0.3868522 0.1671111 0.0143326 -0.0003044 0.0746489 0.2845901 0.002366 -0.0017187 0.0023861 0.383938 0.252132 0.0796416 -0.0018655 0.0497071 0.2030017 0.0043717 -0.0011699 0.0043483 0.3868521 unknown
polarizability: 268.3870372|0.0026027|173.4373828|-0.001554|-2.6954302|57.6134275 unknown
InChI: InChI=1S/C9H8N6O2/c10-8-12-7(13-9(11)14-8)5-1-3-6(4-2-5)15(16)17/h1-4H,10-11H2
charge 0 multiplicity 1
25 atoms
O  5.058453 1.140208 -0.026698
O  5.058513 -1.139948 0.026706
N  -1.954755 1.213806 -0.028336
N  -1.954687 -1.21393 0.028455
N  4.451179 0.000115 0.000037
N  -4.078087 -0.00012101 0.000076
N  -4.008522 2.339715 -0.055333
N  -4.008391 -2.339954 0.0555
C  0.165207 -0.000003 0.000049
C  -1.324445 -0.000045 0.000053
C  0.877661 1.228365 -0.027717
C  0.877729 -1.228332 0.027811
C  2.967353 0.000074 0.00004
C  2.283689 1.23669 -0.027767
C  2.283758 -1.236579 0.027852
C  -3.333226 1.150137 -0.027043
C  -3.333162 -1.150339 0.02718
H  0.304956 2.159298 -0.048826
H  0.305076 -2.159297 0.048923
H  2.856811 2.16705 -0.048652
H  2.856932 -2.166907 0.048734
H  -3.479608 3.207879 -0.075932
H  -5.025418 2.335516 -0.055338
H  -3.479429 -3.208088 0.076099
H  -5.025287 -2.33581 0.055529
