program: Gaussian 09
title: 000274841
version: EM64L-G09RevD.01
frameworkgroup: C1[X(C8H6BrNO2)]
method: RPBEPBE
basis: SDD
operation: Freq
keyword: #p
keyword: freq=noraman
keyword: PBEPBE/SDD
title: #p freq=noraman PBEPBE/SDD
converged: NO YES NO NO
title: Mulliken charges:
elementType: Br O O N C C C C C C C C H H H H H H
charge: 0.048073 -0.215249 -0.228540 0.099181 0.491723 -0.366847 -0.356647 -0.185443 -0.174549 -0.256473 -0.217555 -0.192282 0.247942 0.236825 0.277946 0.260337 0.258609 0.272948
chargesum: 0.00000
title: Mulliken charges with hydrogens summed into heavy atoms:
elementType: Br O O N C C C C C C C C
charge: 0.048073 -0.215249 -0.228540 0.099181 0.491723 -0.118905 -0.119822 0.074894 0.084060 0.021473 -0.217555 0.080666
polarizability: 2.79263298e+02 8.66718205e+00 1.10192798e+02 -4.28753173e-03 -8.31147370e-03 4.15245448e+01
1716.lowfreq: -6.6122 -2.3964 0.0002 0.0007 0.0008 3.7458 40.4953 52.3196 77.6686
frequency: 40.4948 52.3184 77.6614 138.5660 174.0056 189.9565 215.7858 315.2857 341.7723 384.7276 406.8623 500.0603 525.4058 621.0916 625.7523 657.9634 691.9290 724.9605 827.5943 831.9198 841.2246 861.0437 936.4180 960.8188 973.7605 995.8119 1006.5275 1061.9869 1113.7823 1186.8918 1203.6787 1223.5680 1254.7779 1291.3835 1309.8141 1370.5839 1383.6715 1404.3116 1476.2349 1562.6958 1595.7196 1635.3378 3119.2754 3140.0556 3148.6325 3174.3720 3178.1765 3200.4686
redmass: 6.8780 9.5760 9.6916 4.8681 3.4994 16.0675 7.9172 6.3473 3.7662 7.6729 2.8155 2.6987 5.3918 8.4522 7.0123 5.4165 8.3058 3.5705 1.2877 1.5540 4.9885 1.6917 5.7100 1.3345 1.3795 4.5401 1.2719 2.7272 1.4342 1.4469 1.5979 2.2300 2.3275 1.6454 1.4272 4.1485 4.6979 3.5326 2.4265 6.9909 5.9633 5.6862 1.0894 1.0903 1.0889 1.0961 1.0964 1.0954
irintensity: 0.8484 1.5767 3.8444 2.9107 0.0003 1.0116 0.8687 4.8772 0.0576 8.7775 0.0086 31.3830 1.9415 0.3465 0.3311 0.2617 21.4127 0.2659 1.0822 86.2463 7.8605 2.4822 42.6837 3.8716 0.5601 60.6463 47.7438 83.9612 11.6521 192.8397 156.5760 211.0939 34.6450 2.9502 6.0719 33.1999 117.7417 14.0766 80.1795 6.1554 147.1283 170.7095 0.2478 4.0462 3.5680 5.3120 1.2690 11.2941
temp: 298.150 k
press: 1.00000 atm
elementType: 35 8 8 7 6 6 6 6 6 6 6 6 1 1 1 1 1 1
symmnumber: 1
zpe: 322723.4 jmol-1
zpe.correction: 0.122919 hartree
zpe.thermalcorrener: 0.133719 hartree
zpe.thermalcorrenthalpy: 0.134663 hartree
zpe.thermalcorrgfe: 0.083821 hartree
zpe.sumelectzpe: -526.157118 hartree
zpe.sumelectthermal: -526.146319 hartree
zpe.sumelectthermalent: -526.145374 hartree
zpe.sumelectthermalfe: -526.196216 hartree
dipole: 4.9477 -0.0619 0.0023
dipole: 4.9481
quadrupole: -119.2715 -71.0065 -81.0080
quadrupole: 1.1529 -0.0136 0.0048
quadrupole: -28.8428 19.4222 9.4206 1.1529 -0.0136 0.0048
hfenergy: -526.2800372 hartree
pointgroup: C01 [X(C8H6Br1N1O2)]
dipole: 1.9452105 -0.0766355 -0.0010446 debye
dipolederiv: -0.9552786 0.0701901 0.0033791 0.1063193 -0.0515432 -0.0029571 0.0059899 -0.003022 -0.0085122 -0.9866339 -0.2548768 -0.0196675 -0.2866538 -0.6206412 -0.0273442 -0.0219565 -0.0274867 -0.246167 -0.7482397 0.1229865 0.0076371 0.4647482 -0.7431396 -0.0353267 0.0316556 -0.0357791 -0.237348 2.3439664 0.0863421 0.0107526 -0.448335 1.0758781 0.0620335 -0.0269031 0.062991 0.1984722 -0.714574 0.0448201 0.0019049 0.1778242 -0.0356576 -0.0041774 0.0112204 -0.0043724 0.0256508 0.3372354 -0.124953 -0.0082836 0.2646125 0.0611182 0.0154945 0.0193927 0.0147739 -0.1423313 0.249258 0.0672883 0.0056642 -0.3219858 0.0337198 0.0106953 -0.0221714 0.0113297 -0.1189662 -0.5584975 0.2305552 0.0158849 0.3571688 -0.0357514 0.0037006 0.0251736 0.0034941 -0.0785459 -0.6938908 -0.1194623 -0.0098993 -0.2155285 0.0363243 0.0080491 -0.0170436 0.0082469 -0.0778437 1.3417187 -0.0048923 0.0021344 0.2902708 0.0608207 0.0085152 0.0235779 0.0079747 -0.0517544 1.6095497 -0.1392072 -0.0069007 -0.1424544 0.1213241 0.0177132 -0.0070081 0.0177533 -0.1242504 -1.4911265 0.016589 -0.0014005 -0.3627184 0.0663752 0.0133771 -0.0289888 0.0142238 -0.1341554 0.0304062 0.0861075 0.0060378 0.050288 -0.0251821 -0.0133052 0.0034538 -0.013215 0.1570911 0.0038757 -0.0932963 -0.0071034 -0.0536181 -0.0013184 -0.0110566 -0.0041645 -0.011114 0.147739 0.1006522 0.0078995 0.0003807 0.0377392 0.0213251 -0.0101286 0.0030635 -0.0102407 0.1647986 0.0310325 -0.070532 -0.005358 -0.0718061 0.0196271 -0.0106138 -0.0054115 -0.0106041 0.1630475 0.0578916 0.0531727 0.003698 0.0600908 -0.0097847 -0.0124308 0.0041105 -0.0124786 0.1608385 0.0426544 0.0212687 0.0011396 0.0940384 0.0265057 -0.0122382 0.0060096 -0.012475 0.2022369 unknown
polarizability: 279.6055489|4.08183|109.4939448|0.7284916|4.9177721|41.8811469 unknown
InChI: InChI=1S/C8H6BrNO2/c9-8-3-1-7(2-4-8)5-6-10(11)12/h1-6H
charge 0 multiplicity 1
18 atoms
Br 5.018996 -0.323414 -0.017782
O  -4.424501 -1.065422 -0.088311
O  -3.885136 1.155688 0.07117
N  -3.565382 -0.095726 -0.016918
C  0.265474 0.229138 0.014083
C  1.133367 1.356251 0.09764
C  0.850496 -1.068443 -0.079642
C  2.534064 1.206135 0.089129
C  2.246867 -1.233917 -0.089292
C  -1.178825 0.463147 0.027971
C  3.078229 -0.092466 -0.004581
C  -2.15863 -0.482688 -0.040931
H  0.704037 2.362135 0.170354
H  0.216345 -1.958612 -0.145884
H  -1.520861 1.505097 0.100725
H  3.187528 2.080192 0.153779
H  2.686637 -2.232411 -0.161524
H  -2.030004 -1.563086 -0.116786
