program: Gaussian 09
title: 000274854
version: EM64L-G09RevD.01
frameworkgroup: C1[X(C14H12N4)]
method: RPBEPBE
basis: SDD
operation: Freq
keyword: #pfreq=noraman
keyword: PBEPBE/SDD
title: #p freq=noraman PBEPBE/SDD
converged: YES YES NO NO
title: Mulliken charges:
elementType: N N N N C C C C C C C C C C C C C C H H H H H H H H H H H H
charge: -0.164607 -0.034878 -0.165866 -0.059851 0.366349 -0.344689 -0.297494 0.102510 -0.655723 -0.232405 -0.226224 -0.240604 0.272221 -0.347263 -0.345164 -0.204924 -0.239762 -0.190748 0.247168 0.314537 0.236941 0.306331 0.238231 0.228353 0.228317 0.232564 0.247510 0.256688 0.234523 0.237958
chargesum: 0.00000
title: Mulliken charges with hydrogens summed into heavy atoms:
elementType: N N N N C C C C C C C C C C C C C C
charge: -0.164607 -0.034878 -0.165866 -0.059851 0.366349 -0.097521 0.017043 0.102510 0.125779 -0.004052 0.002094 -0.008040 0.272221 -0.099754 -0.088475 0.029599 -0.001804 -0.190748
polarizability: 3.52621017e+02 1.31435912e+01 2.11031493e+02 3.36181278e-01 -1.16854382e-01 7.24831853e+01
1716.lowfreq: 0.0006 0.0007 0.0008 2.2158 3.5847 8.8006 12.2962 31.5470 65.1760
frequency: 11.8906 31.5009 65.1563 73.8630 132.7625 139.6886 160.2425 206.2884 222.8377 261.9291 279.0290 297.6884 324.1394 375.4933 392.7761 397.5900 410.2419 471.9505 504.6467 515.8661 535.2394 558.2147 576.3363 609.0458 615.7430 649.2292 693.1627 723.8834 752.5966 761.3322 764.8654 775.1194 840.3698 878.4359 891.0239 921.3233 966.0004 978.0911 983.0680 994.9217 1004.6169 1022.4542 1032.6068 1044.5893 1085.6191 1088.0515 1116.7300 1122.3315 1170.8153 1172.7595 1184.1166 1187.5930 1197.9312 1241.0225 1270.4238 1289.6398 1323.6813 1351.3958 1375.2222 1385.2755 1429.0287 1438.0068 1448.0115 1463.7928 1474.6379 1488.8418 1490.3137 1559.7976 1581.4967 1605.3234 1606.2934 2155.0540 2990.9183 3077.8763 3131.3672 3136.6018 3138.6968 3141.4774 3149.0617 3162.8939 3163.0340 3175.6476 3181.3526 3212.9398
redmass: 5.4143 3.9544 5.7860 4.5348 4.1885 7.6563 5.1784 7.6171 2.4096 4.9425 1.6708 4.0503 3.8831 4.7086 4.1582 5.4835 2.9723 7.8139 6.7715 3.6664 3.5654 6.7637 4.2677 5.8097 6.4237 6.1751 1.9941 5.9840 5.6219 3.4725 1.7248 1.3207 1.2555 6.5903 1.4716 1.3956 1.3842 1.3518 5.9370 1.3414 1.3078 3.1119 2.2835 2.2200 2.4675 1.8845 2.1658 1.3004 1.1267 1.1801 2.0571 2.6349 1.1581 3.5354 1.6992 2.7798 1.8718 3.6171 6.3418 8.6995 2.2635 1.2154 2.2897 2.5823 2.0656 1.1233 1.0497 6.2144 6.2850 6.3170 6.0303 12.6329 1.0353 1.1024 1.0854 1.1003 1.0856 1.0909 1.0902 1.0948 1.0970 1.1009 1.0952 1.0940
irintensity: 1.5131 0.0254 0.7647 4.9989 0.3748 2.1073 0.4880 6.3380 1.5010 2.1189 0.2635 0.1481 1.3303 0.2888 0.1242 0.1972 0.0919 3.4103 4.3369 18.9147 1.3906 0.6750 1.6678 13.0686 1.3746 4.0888 37.6137 8.2450 28.1303 9.3916 68.7421 91.6902 0.6924 2.2501 0.1801 7.5752 3.8407 0.4169 0.1911 0.1477 2.1414 14.8110 46.0332 23.0843 47.2023 24.6175 8.2480 0.1327 4.6357 1.3240 6.8316 4.2984 0.0080 12.1147 11.1653 32.0557 149.5744 325.5340 202.9526 39.6671 26.2803 26.1297 2.8276 32.6675 125.1344 19.0716 18.4108 10.5930 4.0872 9.9261 18.8648 35.0264 53.5853 21.9514 1.4939 0.5391 1.5889 16.7641 5.3738 18.8296 32.3682 24.6036 11.8278 13.1422
temp: 298.150 k
press: 1.00000 atm
elementType: 7 7 7 7 6 6 6 6 6 6 6 6 6 6 6 6 6 6 1 1 1 1 1 1 1 1 1 1 1 1
symmnumber: 1
zpe: 602995.2 jmol-1
zpe.correction: 0.229669 hartree
zpe.thermalcorrener: 0.245009 hartree
zpe.thermalcorrenthalpy: 0.245953 hartree
zpe.thermalcorrgfe: 0.185090 hartree
zpe.sumelectzpe: -758.375823 hartree
zpe.sumelectthermal: -758.360483 hartree
zpe.sumelectthermalent: -758.359539 hartree
zpe.sumelectthermalfe: -758.420402 hartree
dipole: 1.8148 -2.5778 0.2672
dipole: 3.1638
quadrupole: -81.4391 -102.2298 -110.2270
quadrupole: 14.5730 -0.1825 1.3787
quadrupole: 16.5262 -4.2645 -12.2617 14.5730 -0.1825 1.3787
hfenergy: -758.605492 hartree
pointgroup: C01 [X(C14H12N4)]
dipole: 0.8039771 0.9489356 -0.0502729 debye
polarizability: 348.8820755|-25.6258913|214.3923886|8.7472123|2.9570716|72.8612321 unknown
InChI: InChI=1S/C14H12N4/c1-18(13-8-3-2-4-9-13)17-16-14-10-6-5-7-12(14)11-15/h2-10H,1H3
charge 0 multiplicity 1
30 atoms
N  1.253525 -1.143063 -0.11467
N  -0.048965 -0.732163 -0.157826
N  -0.31461 0.555578 -0.093163
N  -2.511082 -2.797251 -0.051445
C  2.461741 -0.374586 -0.004111
C  3.706431 -1.073397 -0.040243
C  2.475039 1.044398 0.144877
C  -1.721427 0.804065 -0.133341
C  1.320309 -2.621026 -0.21076
C  4.923031 -0.372571 0.069243
C  3.704582 1.726503 0.25365
C  4.934609 1.033167 0.217211
C  -2.773989 -0.177903 -0.129727
C  -2.074673 2.179318 -0.165354
C  -4.129443 0.256932 -0.161366
C  -3.419858 2.591083 -0.198551
C  -4.456121 1.626351 -0.196875
C  -2.550958 -1.600076 -0.087509
H  3.73594 -2.159411 -0.154226
H  1.529258 1.581986 0.1703
H  1.852213 -2.932543 -1.127307
H  0.285337 -2.987917 -0.246346
H  1.82909 -3.047409 0.671452
H  5.865098 -0.930988 0.038159
H  3.694114 2.816231 0.368139
H  5.882811 1.574223 0.30234
H  -1.259234 2.909339 -0.165372
H  -4.921069 -0.499584 -0.155967
H  -3.661718 3.658826 -0.225083
H  -5.505185 1.937788 -0.22063
