program: Gaussian 09
title: 000274856
version: EM64L-G09RevD.01
frameworkgroup: C1[X(C13H9N5O2)]
method: RPBEPBE
basis: SDD
operation: Freq
keyword: #p
keyword: freq=noraman
keyword: PBEPBE/SDD
title: #p freq=noraman PBEPBE/SDD
converged: YES YES NO NO
title: Mulliken charges:
elementType: O O N N N N N C C C C C C C C C C C C C H H H H H H H H H
charge: -0.200410 -0.209570 -0.410831 0.019319 -0.147389 0.020682 -0.055479 0.521518 -0.553602 0.426297 -0.375520 -0.386347 -0.162630 0.057539 0.286354 -0.334562 -0.341520 -0.203713 -0.230744 -0.184837 0.285177 0.323406 0.289281 0.249447 0.316350 0.258424 0.260067 0.240513 0.242778
chargesum: 0.00000
title: Mulliken charges with hydrogens summed into heavy atoms:
elementType: O O N N N N N C C C C C C C C C C C C C
charge: -0.200410 -0.209570 -0.094480 0.019319 -0.147389 0.020682 -0.055479 0.521518 -0.268424 0.426297 -0.052114 -0.097066 0.086817 0.057539 0.286354 -0.076138 -0.081453 0.036800 0.012034 -0.184837
polarizability: 4.19997308e+02 2.00758034e+01 2.00731416e+02 -3.32558532e-02 -1.13907046e-02 6.79396245e+01
1716.lowfreq: -0.0007 -0.0005 0.0007 3.1383 6.8323 8.5918 29.4894 33.6906 53.9555
frequency: 29.4683 33.5669 53.9456 60.6899 103.7254 121.1188 150.2961 172.6009 178.5488 190.5642 215.3240 248.5418 260.9625 316.3436 372.7957 391.7526 392.7155 426.9694 432.3856 515.0413 517.8724 531.9573 536.2792 557.9301 575.4371 636.3670 652.1824 670.2820 686.8037 703.0835 721.5905 724.0887 760.0647 778.0009 778.5944 824.4397 864.0849 896.0593 914.3894 939.2307 953.1531 970.4939 983.3314 999.7421 1013.4717 1036.2475 1081.5642 1092.9174 1103.7389 1165.6342 1173.1716 1181.0618 1189.3305 1213.8750 1224.6670 1252.4975 1277.1452 1307.4895 1347.4070 1373.4871 1379.3688 1400.4254 1430.4080 1439.0615 1464.3063 1476.9142 1508.2911 1560.3097 1592.1884 1604.8852 1619.1926 2162.2897 3143.0037 3153.2005 3154.7840 3162.1982 3167.3097 3169.6942 3179.1790 3193.7982 3385.3688
redmass: 6.7482 7.7484 7.4991 10.8933 5.1289 10.2014 6.0691 5.6654 10.3215 4.3233 6.4074 5.1299 7.7546 6.2329 8.5264 8.6161 4.1763 3.3039 9.1740 7.7994 3.8620 7.4901 5.1639 7.4568 4.2578 6.8819 6.4483 8.4205 2.4560 4.2134 7.2967 1.4041 3.5159 8.0936 1.3076 1.3824 6.8002 1.4537 1.5893 3.9658 1.3630 1.3838 6.2082 1.3460 1.3425 2.3168 2.0122 1.4955 2.1309 4.5344 1.1040 1.1698 2.6229 4.9474 4.5272 2.0462 1.5599 1.5092 6.8008 9.1422 9.7737 6.8394 2.3356 3.3502 2.5745 2.3228 2.4349 6.1573 6.0552 6.3266 6.9108 12.6308 1.0860 1.0907 1.0894 1.0922 1.0950 1.0959 1.1008 1.0962 1.0749
irintensity: 1.4603 1.5812 1.1480 0.3781 0.9772 4.8502 1.6908 4.7561 7.2786 4.1285 5.4700 0.0015 2.6155 2.6620 3.9594 2.8301 0.0665 1.0567 1.2518 4.0813 7.6711 1.6508 5.9254 1.5313 2.1805 13.4995 11.1400 33.3938 11.4281 4.1652 15.1966 121.5678 9.2138 17.3530 78.7670 31.7193 1.2130 0.0361 45.5517 1.1249 1.0464 4.1354 1.9487 0.2508 2.7140 9.7983 10.1137 16.4729 7.7042 241.8856 0.9283 25.0199 1.1165 167.6111 71.5803 347.7990 18.8140 55.3059 144.2700 89.0036 109.5667 124.1846 38.8809 14.5341 48.7032 34.3777 277.9078 2.0056 1.4096 4.7366 77.3300 21.6265 1.8433 5.3261 7.6757 10.4442 10.5785 14.0623 21.2036 2.9657 12.7443
temp: 298.150 k
press: 1.00000 atm
elementType: 8 8 7 7 7 7 7 6 6 6 6 6 6 6 6 6 6 6 6 6 1 1 1 1 1 1 1 1 1
symmnumber: 1
zpe: 533670.2 jmol-1
zpe.correction: 0.203264 hartree
zpe.thermalcorrener: 0.219845 hartree
zpe.thermalcorrenthalpy: 0.220789 hartree
zpe.thermalcorrgfe: 0.157344 hartree
zpe.sumelectzpe: -923.469021 hartree
zpe.sumelectthermal: -923.452441 hartree
zpe.sumelectthermalent: -923.451496 hartree
zpe.sumelectthermalfe: -923.514941 hartree
dipole: -6.4995 -1.1293 0.0292
dipole: 6.5969
quadrupole: -120.6889 -112.8935 -117.3891
quadrupole: 14.4673 0.1241 0.0302
quadrupole: -3.6984 4.0970 -0.3986 14.4673 0.1241 0.0302
hfenergy: -923.6722858 hartree
pointgroup: C01 [X(C13H9N5O2)]
dipole: -2.5455977 0.2818161 0.4204929 debye
polarizability: 418.3431773|-24.4555659|81.3117833|-17.049952|38.6424578|189.0133883 unknown
InChI: InChI=1S/C13H9N5O2/c14-9-10-4-1-2-7-13(10)16-17-15-11-5-3-6-12(8-11)18(19)20/h1-8,15H
charge 0 multiplicity 1
29 atoms
O  6.414639 -0.131809 -0.138699
O  5.419859 0.526897 1.804552
N  0.489679 0.519867 0.869019
N  5.373764 0.148239 0.569848
N  -1.692512 0.739439 1.193412
N  -0.754033 0.421915 0.333814
N  -1.746542 -0.452225 -2.592345
C  1.629352 0.21713 0.093224
C  2.901716 0.330503 0.700533
C  4.039416 0.028068 -0.072745
C  1.510593 -0.192425 -1.265614
C  3.959077 -0.380192 -1.420834
C  2.675935 -0.48416 -2.001314
C  -3.014296 0.64587 0.66957
C  -3.394523 0.245242 -0.660318
C  -4.032456 0.993559 1.59637
C  -4.774375 0.209251 -1.005503
C  -5.39261 0.952543 1.237121
C  -5.768048 0.558562 -0.069711
C  -2.451299 -0.127408 -1.680431
H  3.031464 0.642496 1.74166
H  0.522407 -0.278064 -1.727219
H  4.872631 -0.60328 -1.976519
H  2.578191 -0.798272 -3.045032
H  0.577401 0.819091 1.853395
H  -3.717476 1.294299 2.600204
H  -5.053497 -0.096948 -2.018872
H  -6.157857 1.2257 1.970831
H  -6.823602 0.523808 -0.356696
