program: Gaussian 09
title: 000274850
version: EM64L-G09RevD.01
frameworkgroup: C1[X(C9H10BrN7)]
method: RPBEPBE
basis: SDD
operation: Freq
keyword: #p
keyword: freq=noraman
keyword: PBEPBE/SDD
title: #p freq=noraman PBEPBE/SDD
converged: YES YES NO NO
title: Mulliken charges:
elementType: Br N N N N N N N C C C C C C C C C H H H H H H H H H H
charge: -0.029431 -0.412270 -0.126975 -0.257201 -0.123070 -0.577666 -0.582445 -0.587280 0.132129 0.264902 0.128422 -0.233713 -0.362741 -0.261958 -0.164615 0.015023 0.062773 0.292773 0.279107 0.242528 0.379005 0.295913 0.296137 0.337024 0.333412 0.336148 0.324070
chargesum: 0.00000
title: Mulliken charges with hydrogens summed into heavy atoms:
elementType: Br N N N N N N N C C C C C C C C C
charge: -0.029431 -0.033265 -0.126975 -0.257201 -0.123070 0.014383 0.087991 0.072938 0.132129 0.264902 0.128422 0.059060 -0.083635 -0.261958 0.077914 0.015023 0.062773
polarizability: 2.64670247e+02 9.77662383e-01 2.24307256e+02 -1.57768892e-02 2.97789789e-02 6.67415184e+01
1716.lowfreq: -6.5775 -4.9179 -0.0005 -0.0002 0.0005 4.1849 32.6239 70.1339 85.3879
frequency: 32.6095 70.1334 85.3869 85.6623 145.3168 165.2144 183.0667 200.3380 208.4879 209.0780 267.4312 295.7484 297.9454 329.2591 337.2108 358.2222 452.9370 461.7913 474.8870 490.8549 531.1144 533.9180 533.9364 547.4886 558.9859 589.7600 595.2158 649.1706 682.9566 685.8151 711.0893 751.5134 802.0059 812.4461 834.5132 868.7727 879.6996 917.3033 936.8323 975.6432 985.4492 999.1795 1066.5267 1092.8266 1128.9052 1144.6801 1158.9038 1226.8160 1228.7135 1256.5801 1313.0719 1324.2246 1371.5120 1411.2382 1424.1430 1459.3400 1481.9663 1494.6542 1513.3692 1519.1788 1587.9760 1599.3935 1608.0081 1632.4079 1663.1401 3136.3118 3154.7482 3178.6947 3181.6980 3440.5783 3554.5044 3558.9339 3568.0845 3714.6094 3717.4145
redmass: 5.4231 5.3729 9.0574 4.4853 4.8968 4.9750 6.0856 7.2746 5.7822 7.5460 5.5617 1.3604 4.4289 2.8866 4.2274 4.4975 2.3404 1.4606 3.1422 1.2453 3.2035 1.4094 1.1083 1.0477 7.0117 7.4361 6.2366 5.8484 6.3600 7.1474 10.5007 5.3393 4.9403 5.8128 1.5406 1.1608 4.6876 10.7889 1.3914 1.3124 2.3191 3.6036 1.9634 2.8362 2.4812 2.6265 1.8842 1.5301 1.1697 4.8232 2.2344 3.7881 4.7594 5.8944 6.0070 3.3215 5.3854 2.5458 2.6048 4.1543 2.2034 1.4357 4.1262 2.2185 1.2155 1.0859 1.0891 1.0920 1.0947 1.0406 1.0442 1.0446 1.1042 1.1059 1.1055
irintensity: 0.0003 6.6250 0.4012 0.0006 3.2985 3.8145 10.7189 4.3816 2.2368 4.8074 4.4213 19.1237 7.8690 22.4172 2.9464 2.0672 76.0646 101.8030 4.4974 332.9774 19.0853 176.2810 77.1132 0.0035 4.7793 5.9364 24.2819 22.9570 8.2535 14.1854 1.1653 2.3630 2.9194 18.7017 111.2781 62.0666 13.1752 0.2093 7.4716 4.2117 19.4581 3.2730 4.5286 23.4852 0.6317 8.7118 10.5698 10.1505 0.6209 16.9190 105.9551 323.8476 3.8646 50.6660 120.7455 88.7374 873.9823 129.9463 171.0002 556.0757 82.3906 642.0729 127.1041 170.1556 53.1755 275.5444 1.4780 2.1156 9.1280 3.0798 129.6644 99.2223 2.6742 44.8097 43.0866
temp: 298.150 k
press: 1.00000 atm
elementType: 35 7 7 7 7 7 7 7 6 6 6 6 6 6 6 6 6 1 1 1 1 1 1 1 1 1 1
symmnumber: 1
zpe: 523052.5 jmol-1
zpe.correction: 0.199220 hartree
zpe.thermalcorrener: 0.214847 hartree
zpe.thermalcorrenthalpy: 0.215791 hartree
zpe.thermalcorrgfe: 0.155547 hartree
zpe.sumelectzpe: -744.477871 hartree
zpe.sumelectthermal: -744.462245 hartree
zpe.sumelectthermalent: -744.461301 hartree
zpe.sumelectthermalfe: -744.521544 hartree
dipole: -6.3586 2.1354 0.0144
dipole: 6.7076
quadrupole: -92.4394 -77.8642 -112.2271
quadrupole: -3.5474 -0.0347 0.0554
quadrupole: 1.7375 16.3127 -18.0502 -3.5474 -0.0347 0.0554
hfenergy: -744.6770915 hartree
pointgroup: C01 [X(C9H10Br1N7)]
dipole: 1.9555513 -1.3769398 -1.1153452 debye
polarizability: 257.5278502|-2.3045231|179.3587766|-21.8081439|74.9910487|118.8323951 unknown
InChI: InChI=1S/C9H10BrN7/c10-4-1-2-6(17-13)5(3-4)7-14-8(11)16-9(12)15-7/h1-3,17H,11-13H2
charge 0 multiplicity 1
27 atoms
Br -3.803583 2.296377 2.137722
N  -0.78406 -2.053698 -1.078702
N  1.32019 1.195387 0.859631
N  1.479189 -0.812341 -0.487043
N  3.507765 0.406626 0.103892
N  -1.488456 -3.10616 -1.697027
N  3.285049 2.337578 1.407315
N  3.599605 -1.535773 -1.189448
C  -0.72188 -0.005445 0.279971
C  -1.455339 -1.077994 -0.356368
C  0.743982 0.129125 0.214158
C  -1.444785 0.981915 1.013634
C  -2.878416 -1.112082 -0.226159
C  -2.834292 0.915963 1.11763
C  -3.565489 -0.130288 0.500109
C  2.684421 1.282803 0.772139
C  2.842445 -0.619418 -0.504061
H  -0.864822 1.779735 1.482997
H  -3.40995 -1.932029 -0.715014
H  -4.655512 -0.17326 0.588425
H  0.253964 -1.94157 -1.11111
H  -1.311084 -4.02719 -1.285002
H  -1.461127 -3.082936 -2.720567
H  2.705278 3.00414 1.910698
H  4.296062 2.434803 1.363956
H  4.608722 -1.413924 -1.21529
H  3.150225 -2.316842 -1.658287
