program: Gaussian 09
title: 000274828
version: EM64L-G09RevD.01
frameworkgroup: C1[X(C10H17NO2)]
method: RPBEPBE
basis: SDD
operation: Freq
keyword: #p
keyword: freq=noraman
keyword: PBEPBE/SDD
title: #p freq=noraman PBEPBE/SDD
converged: YES YES NO NO
title: Mulliken charges:
elementType: O O N C C C C C C C C C C H H H H H H H H H H H H H H H H H
charge: -0.292787 -0.270756 -0.062758 -0.381614 -0.385066 -0.554362 -0.559611 0.538853 -0.618123 -0.538524 0.253457 -0.222315 -0.679158 0.219740 0.192709 0.191929 0.219630 0.226443 0.216925 0.278361 0.216657 0.225576 0.189652 0.224579 0.246381 0.228491 0.228640 0.213087 0.228206 0.225760
chargesum: 0.00000
title: Mulliken charges with hydrogens summed into heavy atoms:
elementType: O O N C C C C C C C C C C
charge: -0.292787 -0.270756 -0.062758 0.030835 0.026493 -0.110994 -0.064593 0.538853 0.021683 -0.292143 0.253457 0.234816 -0.012105
polarizability: 1.70099100e+02 6.21420251e+00 1.23649077e+02 6.60864540e+00 3.83873765e+00 8.75328173e+01
1716.lowfreq: -11.8737 -0.0006 -0.0006 -0.0003 2.9150 7.2811 29.3280 45.2787 65.8792
frequency: 28.5661 45.1563 65.8763 88.1215 103.6517 160.5024 165.4396 220.1748 233.2847 248.9808 265.4559 306.3860 318.7028 350.2501 355.3246 374.6894 459.7788 483.0547 508.4325 664.0257 688.6853 689.4814 744.8086 777.7841 798.1965 811.0942 828.9193 887.9841 911.9941 938.1194 995.6581 1011.6908 1012.4790 1028.3752 1061.8036 1069.4527 1110.5086 1116.8894 1134.3877 1139.8586 1144.9371 1167.4076 1174.8386 1239.4364 1246.4468 1251.2300 1273.2289 1289.7354 1309.2637 1316.0306 1339.3840 1356.1760 1363.8331 1378.8007 1398.5901 1431.5427 1444.0755 1461.0652 1464.0294 1464.6178 1466.5445 1473.2527 1483.9094 1484.9650 1486.6120 1581.5166 1659.2881 2836.8454 2842.6393 2863.8685 2981.7303 2986.4353 2992.8477 3009.6637 3018.2415 3026.1520 3031.0425 3059.1725 3066.5066 3076.2605 3089.3313 3103.6692 3116.5899 3124.7400
redmass: 2.9156 3.5488 3.3753 3.3815 2.7713 2.6742 2.8601 1.9485 1.2619 2.1764 1.8672 2.4210 4.1048 2.4663 2.2055 3.2106 2.7453 2.2094 4.9991 4.8802 4.7550 2.5772 3.5214 3.6594 1.0988 1.5860 3.1530 1.4923 3.4804 2.4068 2.2963 1.8447 1.9854 2.6416 1.8261 1.9257 2.2137 1.4530 1.4622 2.4976 2.4454 1.1413 1.7708 1.4595 1.1368 2.6360 1.5342 1.4876 1.5704 1.3308 1.2960 1.4179 1.5543 1.4919 1.2719 1.1698 1.0984 1.0823 1.0505 1.0487 1.0733 1.0596 1.0601 1.0996 1.0700 9.2283 7.6763 1.0710 1.0681 1.0585 1.0628 1.0662 1.0357 1.0582 1.0732 1.0876 1.0896 1.0999 1.1062 1.1009 1.0985 1.1027 1.0925 1.0891
irintensity: 0.5640 0.1374 1.1828 0.3717 2.0678 2.3559 3.9535 2.5094 0.4094 1.4669 2.0756 2.4127 13.2960 3.2526 7.1230 4.1212 0.2484 1.4494 1.7264 3.8007 5.9637 3.0786 10.8008 8.5597 3.7264 0.6165 1.8307 25.4964 45.0428 38.5770 31.3340 18.9825 10.0541 109.6084 3.4766 12.9843 4.6525 19.4366 5.0966 43.5042 17.8251 4.1404 70.7757 29.6403 0.1927 247.9679 1.6864 15.2487 2.0552 13.1453 12.8852 3.2457 21.8700 1.0241 19.8281 4.1661 11.3169 22.9128 24.1790 3.9372 0.4272 6.3431 8.9873 12.7670 11.6059 153.8698 268.9762 55.5786 54.6302 214.2293 6.5250 30.4810 19.8601 22.4901 46.2493 54.1255 46.5823 29.7872 6.5667 34.4915 35.2258 48.4017 4.1116 10.6054
temp: 298.150 k
press: 1.00000 atm
elementType: 8 8 7 6 6 6 6 6 6 6 6 6 6 1 1 1 1 1 1 1 1 1 1 1 1 1 1 1 1 1
symmnumber: 1
zpe: 673381.0 jmol-1
zpe.correction: 0.256477 hartree
zpe.thermalcorrener: 0.270592 hartree
zpe.thermalcorrenthalpy: 0.271536 hartree
zpe.thermalcorrgfe: 0.214554 hartree
zpe.sumelectzpe: -595.406786 hartree
zpe.sumelectthermal: -595.392672 hartree
zpe.sumelectthermalent: -595.391728 hartree
zpe.sumelectthermalfe: -595.448710 hartree
dipole: 2.0304 2.4593 0.0107
dipole: 3.1892
quadrupole: -74.9486 -79.8763 -80.4735
quadrupole: -11.8300 -4.2007 -2.5956
quadrupole: 3.4842 -1.4435 -2.0407 -11.8300 -4.2007 -2.5956
hfenergy: -595.6632636 hartree
pointgroup: C01 [X(C10H17N1O2)]
dipole: 0.781953 0.9385529 0.2864068 debye
polarizability: 170.0630056|5.1932499|118.3858882|7.072026|13.6094614|92.8321001 unknown
InChI: InChI=1S/C10H17NO2/c1-3-13-10(12)8-9-4-6-11(2)7-5-9/h8H,3-7H2,1-2H3
charge 0 multiplicity 1
30 atoms
O  -2.275984 0.287153 0.002027
O  -2.897882 -1.596501 -1.217139
N  3.011431 0.694887 0.102061
C  2.936008 -0.557424 -0.681544
C  1.713264 1.407234 0.113384
C  1.862967 -1.506577 -0.087092
C  0.591481 0.524551 0.722733
C  0.515095 -0.808074 0.004484
C  4.128506 1.561033 -0.320635
C  -0.589579 -1.386245 -0.564975
C  -1.995754 -0.93628 -0.633307
C  -3.702728 0.726729 -0.06507
C  -3.787318 2.063978 0.66463
H  3.924624 -1.052281 -0.651396
H  2.691003 -0.360321 -1.758414
H  1.40715 1.722094 -0.918664
H  1.822879 2.325223 0.720131
H  2.195053 -1.788891 0.931925
H  1.798821 -2.426512 -0.695644
H  -0.371173 1.053272 0.693126
H  0.856281 0.334797 1.782628
H  4.190043 2.439996 0.345972
H  4.030631 1.932011 -1.37254
H  5.080568 1.00583 -0.242258
H  -0.467742 -2.355096 -1.06634
H  -3.995885 0.804053 -1.127787
H  -4.329978 -0.052561 0.404523
H  -4.829416 2.432473 0.649985
H  -3.471389 1.960523 1.7171
H  -3.146077 2.820522 0.179996
