program: Gaussian 09
title: 000274827
version: EM64L-G09RevD.01
frameworkgroup: C1[X(C10H17O2P)]
method: RPBEPBE
basis: SDD
operation: Freq
keyword: #p
keyword: freq=noraman
keyword: PBEPBE/SDD
title: #p freq=noraman PBEPBE/SDD
converged: YES YES NO NO
title: Mulliken charges:
elementType: P O O C C C C C C C C C C H H H H H H H H H H H H H H H H H
charge: 0.586673 -0.296217 -0.270574 -0.710646 -0.719394 -0.560259 -0.567380 0.560454 -0.932251 -0.518654 0.258398 -0.259567 -0.665286 0.245424 0.252299 0.253098 0.247290 0.230801 0.227251 0.217332 0.294134 0.247203 0.241237 0.247792 0.246638 0.236545 0.216122 0.215702 0.223176 0.252660
chargesum: 0.00000
title: Mulliken charges with hydrogens summed into heavy atoms:
elementType: P O O C C C C C C C C C C
charge: 0.586673 -0.296217 -0.270574 -0.212924 -0.219006 -0.102207 -0.055914 0.560454 -0.196019 -0.272016 0.258398 0.193099 0.026252
polarizability: 1.91289671e+02 3.93295945e+00 1.32608958e+02 4.89523388e+00 2.19266098e+00 1.03528442e+02
1716.lowfreq: -5.0657 -0.0019 -0.0017 -0.0011 6.1065 11.9098 23.8355 35.8609 59.7908
frequency: 22.6654 35.6794 59.7735 84.3880 111.4163 140.4240 147.2591 174.2729 203.2914 217.2425 230.4287 269.2058 298.2621 306.3704 326.6298 382.2915 413.8858 426.6699 484.3534 603.8847 631.3046 657.3539 667.7520 681.2914 688.1073 732.3226 772.7096 791.5850 820.3165 878.6324 894.9966 906.1437 911.9886 931.1563 940.6985 983.8489 1000.7973 1019.1293 1026.4009 1094.7649 1105.3130 1118.2228 1151.2993 1152.1765 1174.9558 1223.9796 1253.0146 1266.1679 1278.0192 1281.1897 1315.1426 1323.7810 1330.0411 1355.4862 1370.3375 1389.1374 1433.8510 1444.3062 1451.4280 1453.7810 1454.6567 1455.6141 1461.1608 1468.0707 1484.8869 1583.6071 1655.1990 2960.6236 2965.9197 2982.3980 2986.2912 2990.7734 2991.6897 3028.5393 3039.4758 3062.8531 3065.4188 3085.4824 3092.2193 3092.2603 3101.3780 3104.5102 3117.4515 3125.7649
redmass: 3.6440 3.6576 4.0122 4.1193 2.9673 1.2064 3.1056 2.0547 1.9361 1.5696 3.5217 3.6192 2.4480 2.6367 3.2676 3.2814 2.6637 3.2023 3.4118 4.3742 3.5562 3.7457 4.9353 3.9097 4.0715 2.8981 1.5223 1.8146 1.8216 1.4679 2.9360 1.3015 1.3337 2.0024 1.5125 2.5150 2.2488 3.3695 2.4844 2.1582 1.0893 1.9247 1.2703 1.6485 1.4199 1.5790 1.9408 1.2527 1.1209 1.2483 1.3946 1.1986 1.3223 1.3126 1.5429 1.2335 1.0944 1.0756 1.0516 1.1039 1.0779 1.0703 1.0453 1.0942 1.0513 7.8824 7.4339 1.0659 1.0657 1.0334 1.0584 1.0583 1.0362 1.0589 1.0974 1.1035 1.1036 1.0979 1.1032 1.1008 1.0918 1.1000 1.1055 1.0888
irintensity: 0.6751 0.1264 2.6508 0.3279 0.8197 0.1156 1.0564 2.2248 0.7319 0.4885 1.4936 0.9443 3.3489 0.4696 13.9949 0.1876 5.5242 3.5530 1.5669 1.3289 6.1308 8.1031 3.8116 2.8346 2.3632 18.4865 0.3248 5.2149 0.3666 22.7809 36.5241 4.7356 18.2614 49.3652 9.0675 1.8667 9.4615 130.4948 7.0875 23.8856 0.8401 17.1286 30.2982 19.0602 56.6316 30.6910 158.6937 27.1966 5.3272 4.4891 2.9181 13.0152 1.1192 4.8645 8.1593 25.5339 3.3644 13.4798 10.8687 21.0370 8.0671 20.4688 12.7989 21.4331 13.8642 131.1597 262.8132 8.8227 32.1082 42.4041 19.0703 26.3080 22.4270 33.0763 29.9630 21.5135 20.3371 36.6115 3.1074 24.6252 5.1075 11.9457 28.2137 8.6765
temp: 298.150 k
press: 1.00000 atm
elementType: 15 8 8 6 6 6 6 6 6 6 6 6 6 1 1 1 1 1 1 1 1 1 1 1 1 1 1 1 1 1
symmnumber: 1
zpe: 659127.8 jmol-1
zpe.correction: 0.251049 hartree
zpe.thermalcorrener: 0.266179 hartree
zpe.thermalcorrenthalpy: 0.267123 hartree
zpe.thermalcorrgfe: 0.207488 hartree
zpe.sumelectzpe: -881.906483 hartree
zpe.sumelectthermal: -881.891353 hartree
zpe.sumelectthermalent: -881.890409 hartree
zpe.sumelectthermalfe: -881.950044 hartree
dipole: -1.2792 -1.7854 0.0856
dipole: 2.1980
quadrupole: -88.3956 -84.9648 -88.5558
quadrupole: -12.3934 -6.8549 -3.3754
quadrupole: -1.0902 2.3406 -1.2504 -12.3934 -6.8549 -3.3754
hfenergy: -882.1575319 hartree
pointgroup: C01 [X(C10H17O2P1)]
dipole: 0.4676583 -0.654326 0.3177531 debye
polarizability: 189.9324203|-1.7868229|125.1667884|11.5999746|-13.2171971|112.3278617 unknown
InChI: InChI=1S/C10H17O2P/c1-3-12-10(11)8-9-4-6-13(2)7-5-9/h8H,3-7H2,1-2H3
charge 0 multiplicity 1
30 atoms
P  3.367973 -0.273948 0.80866
O  -2.161177 -0.50289 -0.131222
O  -2.859825 1.097852 -1.676685
C  2.944086 1.05002 -0.513305
C  1.651725 -1.126282 0.741119
C  1.689489 1.867595 -0.089789
C  0.514075 -0.111245 1.056642
C  0.436188 1.004139 0.025981
C  4.367005 -1.481778 -0.277207
C  -0.634535 1.288951 -0.782959
C  -1.96383 0.65158 -0.910109
C  -3.508357 -1.143543 -0.239275
C  -4.505316 -0.486841 0.720201
H  2.765416 0.557796 -1.489298
H  3.811907 1.725489 -0.621779
H  1.638503 -1.940175 1.488254
H  1.494993 -1.574948 -0.258982
H  1.52489 2.687203 -0.8135
H  1.893593 2.33827 0.895158
H  0.721496 0.34807 2.046684
H  -0.446333 -0.641238 1.12337
H  5.34546 -1.032174 -0.519227
H  3.836219 -1.720594 -1.216904
H  4.547142 -2.414972 0.283553
H  -0.550809 2.139519 -1.471817
H  -3.851063 -1.066261 -1.285844
H  -3.314489 -2.196586 0.02252
H  -5.468274 -1.030087 0.687322
H  -4.130283 -0.512061 1.758141
H  -4.69127 0.560941 0.431394
