program: Gaussian 09
title: 000274826
version: EM64L-G09RevD.01
frameworkgroup: C1[X(C16H19OP)]
method: RPBEPBE
basis: SDD
operation: Freq
keyword: #p
keyword: freq=noraman
keyword: PBEPBE/SDD
title: #p freq=noraman PBEPBE/SDD
converged: YES YES NO NO
title: Mulliken charges:
elementType: P O C C C C C C C C C C C C C C C C H H H H H H H H H H H H H H H H H H H
charge: 0.731916 -0.531549 -0.895930 -0.911246 0.493395 0.473650 -0.401720 -0.362118 -0.370180 -0.402197 -0.226395 -0.222641 -0.224954 -0.230710 -0.227788 -0.244506 -0.241804 -0.663686 0.269719 0.270470 0.276965 0.269912 0.233393 0.237874 0.247496 0.234050 0.198258 0.209628 0.223876 0.225701 0.225317 0.226286 0.226892 0.228972 0.202738 0.224650 0.226269
chargesum: 0.00000
title: Mulliken charges with hydrogens summed into heavy atoms:
elementType: P O C C C C C C C C C C C C C C C C
charge: 0.731916 -0.531549 -0.355741 -0.364369 0.493395 0.473650 -0.168327 -0.124245 -0.122683 -0.168148 0.181491 0.001236 0.000746 -0.005394 -0.001503 -0.017615 -0.012832 -0.010030
polarizability: 2.59388805e+02 -1.83065090e+01 1.88519468e+02 -6.17042755e+00 7.43271702e+00 1.52563384e+02
1716.lowfreq: -14.9942 -9.0397 -5.7210 -0.0020 -0.0019 0.0020 16.2894 17.9647 22.9726
frequency: 14.8130 17.9207 22.3727 31.4439 38.3519 57.1029 64.1922 78.0310 139.3153 156.1030 181.7071 219.7753 244.0497 276.0172 286.3359 334.3646 344.0519 360.5803 402.9775 403.6579 472.0561 475.6440 553.2478 562.7040 615.9539 616.7037 626.9358 635.1448 666.1137 703.0029 703.8618 772.8278 774.5395 799.1402 801.1821 808.7159 838.6070 850.2156 856.3355 872.7532 886.3640 919.4355 924.2552 975.0972 977.4214 988.6720 988.8357 993.8689 994.0797 1026.7632 1026.9887 1034.6294 1064.7853 1070.3880 1103.2894 1117.6540 1128.9472 1136.7278 1171.3327 1172.2296 1187.1317 1187.6926 1197.8737 1204.8747 1221.0136 1221.9646 1249.1702 1324.3609 1326.2899 1357.0030 1380.6097 1382.0231 1388.2821 1430.4763 1436.4763 1439.6445 1444.3849 1455.5065 1476.0910 1482.0270 1482.2415 1491.1244 1589.7637 1590.5590 1611.6118 1612.2090 2954.4008 2989.0891 3002.6281 3010.0903 3010.4987 3077.8204 3080.9140 3085.5258 3098.8205 3117.0312 3118.2582 3119.4657 3122.1235 3134.2023 3135.4571 3145.1583 3145.2275 3161.8729 3163.3415
redmass: 2.3505 3.8235 4.0528 4.1320 4.0524 2.6122 3.8800 4.3980 4.8639 4.5669 4.9420 4.8628 1.2026 5.2111 4.6670 2.1487 1.9961 4.0236 2.8148 2.8342 3.6403 3.7737 5.2537 5.1777 6.0376 6.2589 5.2871 4.0430 4.4865 1.6750 1.7597 1.8739 2.0604 3.9568 4.0261 1.0899 1.6581 1.2684 1.2880 1.8205 2.5927 1.4416 1.4824 1.3882 1.3867 6.2624 6.1619 1.3111 1.3103 2.2180 2.2011 3.1400 1.4814 1.5623 2.1597 1.1310 1.4128 1.1087 1.0508 1.0510 1.1193 1.1203 1.2275 1.2281 3.0472 3.0990 1.1574 1.2816 1.2715 1.2617 8.3325 8.1819 1.2529 1.1234 1.7531 2.1839 1.2739 1.0416 1.0544 2.3183 2.2735 1.0862 6.0434 6.0345 6.1415 6.0963 1.0558 1.0359 1.0576 1.0834 1.0807 1.1046 1.1044 1.0984 1.1013 1.0856 1.0855 1.0878 1.0869 1.0914 1.0919 1.0963 1.0961 1.1016 1.1016
irintensity: 0.0732 0.1467 0.0191 0.0059 0.3238 1.1261 0.5448 3.0333 2.3921 1.0265 3.4439 0.8903 0.6807 5.0321 3.6908 0.2793 1.2287 0.1490 0.0306 0.0156 13.3304 31.8743 2.0078 2.8518 2.8389 0.0868 30.4678 7.8081 0.3449 53.6569 47.6878 46.3010 53.1061 5.8748 7.6405 5.9938 15.1689 0.7677 1.5722 9.8040 68.8993 4.1293 8.4058 0.0856 0.3490 0.0518 0.0180 0.2404 0.3050 15.5352 7.4715 128.6863 6.4333 16.5173 14.0955 1.0983 2.2068 4.2927 0.1013 0.0490 0.4672 0.7384 2.2391 7.4313 11.0174 1.9450 0.2852 0.4231 0.5063 19.7627 0.1677 0.2002 35.3483 10.8371 6.7671 8.5415 9.7170 10.9311 4.9479 40.8216 14.9218 5.0592 1.3860 1.8783 24.9847 8.5941 59.0407 31.7810 12.9043 13.4799 32.1685 3.4704 5.6310 37.9473 41.0121 6.8569 10.2083 1.9669 0.0747 12.8697 17.7094 33.0102 47.9347 26.0505 23.5341
temp: 298.150 k
press: 1.00000 atm
elementType: 15 8 6 6 6 6 6 6 6 6 6 6 6 6 6 6 6 6 1 1 1 1 1 1 1 1 1 1 1 1 1 1 1 1 1 1 1
symmnumber: 1
zpe: 796850.2 jmol-1
zpe.correction: 0.303504 hartree
zpe.thermalcorrener: 0.322054 hartree
zpe.thermalcorrenthalpy: 0.322998 hartree
zpe.thermalcorrgfe: 0.251655 hartree
zpe.sumelectzpe: -1036.240463 hartree
zpe.sumelectthermal: -1036.221913 hartree
zpe.sumelectthermalent: -1036.220969 hartree
zpe.sumelectthermalfe: -1036.292312 hartree
dipole: 0.0907 -0.0532 -0.3980
dipole: 0.4117
quadrupole: -105.9334 -111.2902 -112.2213
quadrupole: -5.6728 -0.4518 -0.3318
quadrupole: 3.8816 -1.4752 -2.4063 -5.6728 -0.4518 -0.3318
hfenergy: -1036.5439673 hartree
pointgroup: C01 [X(C16H19O1P1)]
dipole: 0.0405209 0.0215878 0.1553251 debye
polarizability: 255.4272334|25.1725701|192.5068107|1.2006655|7.5748493|152.5376126 unknown
InChI: InChI=1S/C16H19OP/c1-2-17-18(13-15-9-5-3-6-10-15)14-16-11-7-4-8-12-16/h3-12H,2,13-14H2,1H3
charge 0 multiplicity 1
37 atoms
P  0.192995 -1.047719 0.58394
O  -0.795065 -2.360403 -0.165588
C  -0.412884 0.373084 -0.572967
C  1.794656 -1.513829 -0.385942
C  -1.797231 0.85406 -0.201161
C  2.8619 -0.445333 -0.28788
C  -1.979234 1.950805 0.682429
C  3.587855 -0.256139 0.919712
C  -2.949186 0.19639 -0.711171
C  3.148263 0.406455 -1.387504
C  -1.745958 -3.06537 0.72524
C  -3.275193 2.382334 1.044042
C  4.572225 0.751206 1.023391
C  -4.245885 0.626998 -0.351279
C  4.134126 1.414551 -1.287025
C  -4.414786 1.722476 0.527644
C  4.849862 1.591577 -0.080408
C  -2.355634 -4.198324 -0.100718
H  -0.38637 -0.036298 -1.59915
H  0.336242 1.180759 -0.490151
H  1.489396 -1.71111 -1.428796
H  2.129652 -2.468215 0.057704
H  -1.100537 2.4692 1.085905
H  3.380159 -0.905997 1.778884
H  -2.81858 -0.655689 -1.388595
H  2.602597 0.270682 -2.329428
H  -1.21389 -3.464733 1.613579
H  -2.529946 -2.363745 1.075756
H  -3.395968 3.234078 1.723291
H  5.124188 0.879297 1.961583
H  -5.1231 0.111352 -0.758999
H  4.34546 2.056932 -2.14952
H  -5.420178 2.059454 0.804273
H  5.615648 2.371305 -0.001967
H  -3.081043 -4.770575 0.507524
H  -2.881146 -3.794376 -0.983504
H  -1.569011 -4.888241 -0.452046
