program: Gaussian 09
title: 000274998
version: EM64L-G09RevD.01
frameworkgroup: C1[X(C9H10N2O4)]
method: RPBEPBE
basis: SDD
operation: Freq
keyword: #p
keyword: freq=noraman
keyword: PBEPBE/SDD
title: #p freq=noraman PBEPBE/SDD
converged: YES YES NO NO
title: Mulliken charges:
elementType: O O O O N N C C C C C C C C C H H H H H H H H H H
charge: -0.260864 -0.405813 -0.211060 -0.265116 -0.171293 0.058575 0.455739 -0.308798 -0.370908 -0.528401 0.329534 -0.356129 -0.333651 0.219204 -0.537526 0.307540 0.280115 0.248094 0.265594 0.255264 0.246681 0.222467 0.225544 0.248420 0.386790
chargesum: 0.00000
title: Mulliken charges with hydrogens summed into heavy atoms:
elementType: O O O O N N C C C C C C C C C
charge: -0.260864 -0.019024 -0.211060 -0.265116 -0.171293 0.058575 0.455739 -0.060704 -0.105314 0.059253 0.329534 -0.100865 -0.086971 0.219204 0.158905
polarizability: 2.10540137e+02 1.57664277e+01 1.25851015e+02 -3.57025735e+00 2.04644786e+00 7.21611809e+01
1716.lowfreq: 0.0006 0.0009 0.0009 4.5856 8.7334 10.7038 23.3388 39.7224 45.1403
frequency: 20.7324 39.5866 45.1074 67.5991 97.4956 123.1510 161.3402 213.8158 232.5607 255.8091 285.7738 332.7124 346.1579 374.4373 414.2310 423.2184 468.9202 482.4465 498.9844 533.1759 588.1676 613.2538 633.4327 652.5097 717.7695 756.7632 806.5888 811.9289 827.6305 853.6161 880.8190 938.8105 951.5960 985.3629 993.9534 1024.8297 1050.8826 1077.8618 1112.8492 1123.3469 1159.3984 1179.7969 1232.5374 1241.1694 1262.5429 1306.1046 1321.0385 1348.2975 1368.3255 1386.1182 1414.0304 1432.2292 1438.6818 1468.8802 1473.5129 1503.1659 1584.0694 1623.6060 1679.9205 2963.3427 3022.1632 3052.7249 3091.4375 3129.5201 3154.7811 3159.1740 3176.1377 3182.7417 3519.1896
redmass: 6.3463 4.3866 9.9527 5.0961 5.7185 4.7043 5.3689 2.1200 3.6260 1.8969 5.3535 4.1943 6.8672 4.9919 2.9862 5.3627 2.2886 3.5239 4.3938 2.6012 5.5932 2.8257 2.2409 4.2202 3.8787 5.2350 1.2631 4.1495 1.7601 4.6870 4.8998 1.3609 1.3588 8.4436 3.3319 2.6344 2.8112 3.9414 1.2590 1.3413 1.3181 1.2182 1.9655 1.9244 1.6194 1.3640 3.8284 3.9263 1.6552 6.1130 1.2069 2.7431 1.2622 1.0498 1.0805 2.5541 7.5459 6.4093 8.7544 1.0329 1.0590 1.1041 1.1008 1.0996 1.0881 1.0882 1.0966 1.0963 1.0643
irintensity: 0.9884 2.5412 1.5606 0.3192 2.9921 7.0999 5.3880 1.0199 1.4350 2.8220 2.0594 0.3502 0.8376 1.6381 0.0915 5.3308 26.2160 3.1552 42.1007 34.0482 14.0198 63.5941 75.4166 10.4560 0.5652 10.2456 3.6571 9.6792 80.7573 6.4947 169.1319 4.5538 1.3315 52.2386 2.6766 91.3859 215.6159 132.9096 0.1739 31.3561 3.8290 81.9494 74.6829 124.8946 8.7014 22.7715 178.6703 52.6499 31.1369 12.5815 51.4238 2.3733 14.1695 14.2466 62.9091 168.4193 5.4002 59.5950 189.4731 69.4514 5.8641 46.0887 0.1132 23.4615 7.6959 8.7112 5.3319 1.1113 36.3531
temp: 298.150 k
press: 1.00000 atm
elementType: 8 8 8 8 7 7 6 6 6 6 6 6 6 6 6 1 1 1 1 1 1 1 1 1 1
symmnumber: 1
zpe: 482656.5 jmol-1
zpe.correction: 0.183834 hartree
zpe.thermalcorrener: 0.198276 hartree
zpe.thermalcorrenthalpy: 0.199220 hartree
zpe.thermalcorrgfe: 0.140333 hartree
zpe.sumelectzpe: -758.168535 hartree
zpe.sumelectthermal: -758.154093 hartree
zpe.sumelectthermalent: -758.153148 hartree
zpe.sumelectthermalfe: -758.212035 hartree
dipole: -2.9316 -1.8445 -2.4549
dipole: 4.2453
quadrupole: -67.9095 -88.2264 -91.8453
quadrupole: -19.4000 -4.0633 -0.9860
quadrupole: 14.7509 -5.5660 -9.1849 -19.4000 -4.0633 -0.9860
hfenergy: -758.3523689 hartree
pointgroup: C01 [X(C9H10N2O4)]
dipole: 1.2064362 0.7546665 -0.8744645 debye
dipolederiv: -1.9905219 -0.0364877 -0.0890889 -0.1578473 -0.3266734 -0.0096291 -0.1237285 -0.0004953 -0.3020432 -1.1374691 0.3472386 -0.3455065 0.4093139 -0.5685314 0.2387588 -0.2661686 0.1571505 -0.3955633 -0.6386134 0.184518 -0.0635174 0.1247334 -0.3933532 -0.1758009 -0.2258611 -0.0824876 -0.8518564 -1.4437145 -0.8689956 0.1181936 -0.2088431 -0.4468793 0.0559454 -0.2243402 -0.128692 -0.2079576 -0.3193478 -0.0500981 -0.0100527 -0.6658438 -0.6646369 0.0410238 0.3249169 0.2032901 -0.1465824 1.0131252 0.9477319 -0.1480036 0.8514532 0.8421833 -0.2170385 -0.0365493 -0.0972721 0.0045046 0.5581742 0.0983546 0.0276051 0.1949692 -0.1151132 0.0713218 -0.1115179 0.0117483 0.0142283 0.1234992 0.0802482 0.0148767 0.0070574 0.1080261 0.017045 -0.0310464 0.0567444 -0.1279684 0.1400758 -0.0524658 -0.0027284 0.0476686 0.0540482 0.0320081 0.0046442 0.0000583 -0.1238314 0.0857299 -0.0439388 0.0787773 -0.0575155 0.1016678 -0.0593096 0.129666 -0.1719574 0.006051 1.6381279 0.2033501 0.0970633 0.5148522 0.0709616 0.0229756 0.1468504 0.0099083 0.1068595 -0.4549815 -0.1137412 -0.0168536 0.2669083 0.0929832 0.0379056 0.0361372 0.0306716 -0.161171 -0.3333445 -0.0211623 0.0021559 -0.4661848 -0.0754552 -0.0000537 -0.0507174 0.0089174 -0.193069 1.3840308 -0.6078985 0.3129242 -0.6776878 0.6035968 0.1549873 0.3158916 0.172286 1.1032373 0.810044 -0.0919078 0.0155469 -0.508444 0.2928491 -0.0279097 -0.0077416 -0.0067411 0.323241 0.017425 0.0270949 -0.0626809 -0.0517244 0.0673824 -0.0720595 0.0100694 0.0067997 0.1168201 0.1014874 -0.0209439 0.0816275 0.0147877 0.014731 0.0528751 0.0764183 0.0293881 0.0916794 0.0212898 0.0913839 0.001669 0.1053092 0.0236271 -0.0087479 -0.004251 -0.0168205 0.1419277 0.0836092 -0.052525 -0.0169789 -0.0361149 0.0029605 -0.0285054 -0.025603 -0.0241137 0.1558433 0.0734608 -0.0491584 -0.0078321 -0.0550254 -0.0301735 -0.0243978 -0.0111418 -0.0209983 0.1639003 -0.0200297 0.0873248 -0.0001431 0.1022661 0.0175944 -0.0099291 -0.0069261 -0.0136919 0.1629261 0.03009 -0.0062071 -0.0406308 0.1696006 -0.001814 -0.0950493 0.0486751 -0.1007897 -0.1071238 0.0304241 -0.0307409 0.0570419 0.1561942 -0.0356809 0.122726 -0.0032286 0.1066938 -0.0612706 -0.1288221 -0.0609195 -0.0226975 -0.1077609 0.0514709 -0.0147122 -0.0278937 -0.0114112 0.1219945 0.3562513 0.0399455 0.0192333 0.0278779 0.3142288 -0.10443 0.0634461 -0.1181856 0.1652242 unknown
polarizability: 211.5983514|11.1875302|124.4947135|7.5628406|2.8316827|72.4592682 unknown
InChI: InChI=1S/C9H10N2O4/c1-15-8-4-2-7(3-5-8)11(10-14)6-9(12)13/h2-5,12H,6H2,1H3
charge 0 multiplicity 1
25 atoms
O  4.157911 0.743342 0.162816
O  -4.198448 1.668558 -0.459662
O  -2.710975 1.363897 1.305374
O  -2.971895 -2.119329 -0.025813
N  -1.313825 -0.621239 -0.31447
N  -1.717078 -1.893683 0.128846
C  0.077931 -0.302259 -0.193192
C  0.491651 1.044951 -0.020292
C  1.047555 -1.333252 -0.236044
C  -2.299187 0.291596 -0.904709
C  2.827644 0.322599 0.043643
C  1.856904 1.354853 0.085958
C  2.417347 -1.026336 -0.111409
C  -3.049757 1.134644 0.129227
C  5.199925 -0.287959 0.157104
H  -3.046976 -0.311382 -1.450263
H  -1.795512 0.964086 -1.619024
H  -0.248354 1.845177 0.076024
H  0.725014 -2.369159 -0.368102
H  2.192929 2.386459 0.224454
H  3.148305 -1.839022 -0.149507
H  5.210275 -0.843717 -0.800547
H  5.068549 -0.996012 0.998063
H  6.145434 0.260208 0.277643
H  -4.68657 2.229581 0.202182
