program: Gaussian 09
title: 000274986
version: EM64L-G09RevD.01
frameworkgroup: C1[X(C11H13F)]
method: RPBEPBE
basis: SDD
operation: Freq
keyword: #pfreq=noraman
keyword: PBEPBE/SDD
title: #p freq=noraman PBEPBE/SDD
converged: YES YES NO NO
title: Mulliken charges:
elementType: F C C C C C C C C C C C H H H H H H H H H H H H H
charge: -0.216895 0.272699 0.131648 -0.642927 -0.727257 -0.726830 0.417930 -0.415566 -0.383442 -0.228597 -0.232612 -0.236283 0.253862 0.237805 0.212563 0.244172 0.212317 0.216557 0.225110 0.216285 0.238792 0.245753 0.227134 0.227983 0.229800
chargesum: 0.00000
title: Mulliken charges with hydrogens summed into heavy atoms:
elementType: F C C C C C C C C C C C
charge: -0.216895 0.272699 0.131648 -0.151260 -0.058205 -0.068878 0.417930 -0.176774 -0.137689 -0.001463 -0.004629 -0.006483
polarizability: 1.45741605e+02 6.34643091e-03 1.13077967e+02 -5.56204385e+00 -1.83795334e+00 7.71355638e+01
1716.lowfreq: -7.8007 -0.0002 0.0009 0.0011 3.2838 10.3990 17.2921 83.9933 117.9877
frequency: 12.2729 83.9770 117.9861 165.6229 186.7166 209.0876 226.2224 274.6829 304.2258 352.0200 372.5908 403.4445 423.1607 484.2734 520.4907 545.9284 615.1197 672.2348 702.7501 724.3476 772.3254 835.3988 854.1591 880.1422 903.0404 931.6888 958.9034 972.5594 978.5142 991.2650 997.7022 1009.6563 1022.9880 1042.4280 1064.1266 1084.1164 1119.1317 1134.0331 1173.4565 1186.7436 1253.4562 1286.1753 1315.5378 1378.7681 1379.0778 1387.2684 1399.9107 1434.8414 1448.3157 1461.2583 1467.6129 1477.8317 1484.9649 1496.8699 1590.3317 1615.9706 2972.8442 2978.2290 3059.3585 3062.8792 3080.9388 3093.3714 3099.3238 3123.8694 3130.1462 3141.3805 3150.8341 3165.3757 3196.7540
redmass: 3.7684 3.8837 2.9588 1.0691 1.5899 2.2122 3.1313 3.1304 5.3880 2.5746 2.9093 2.8100 2.2541 4.1903 3.4326 3.0578 6.3964 5.7616 1.7267 3.7699 2.0254 1.9841 1.2612 3.5148 1.3513 1.5564 1.3102 2.1406 1.3997 5.5321 1.3448 1.5693 2.1163 1.3850 1.8686 1.6230 2.4552 1.9893 1.0530 1.1119 3.6769 3.3599 1.3506 2.2684 6.4074 1.3048 1.2191 2.1471 1.3237 1.0489 1.0498 1.1082 1.1792 2.1898 6.1323 6.1341 1.0361 1.0369 1.0994 1.0986 1.0989 1.0571 1.0977 1.0845 1.0876 1.0923 1.0968 1.1017 1.1150
irintensity: 0.3447 0.7452 0.2615 0.0830 0.6856 0.7923 0.5751 3.3144 3.2321 0.6106 2.0835 0.2053 0.2976 12.6690 0.9272 6.0230 0.0054 6.0278 54.1189 8.9051 58.8717 21.0322 0.3883 10.1762 0.1833 1.2457 4.1447 20.6142 0.5143 0.1932 0.1287 6.8685 10.3336 10.0250 10.2743 12.0324 21.3026 33.1328 0.0018 0.7476 20.2661 7.3442 1.2271 13.6018 2.0035 10.4274 6.5028 7.0368 33.2401 2.0407 9.1549 9.4589 17.4054 1.5615 0.6544 0.9431 25.7769 50.5280 0.3646 63.3225 29.1636 8.1790 18.1882 1.7365 0.3172 18.3450 37.2992 18.7239 8.4960
temp: 298.150 k
press: 1.00000 atm
elementType: 9 6 6 6 6 6 6 6 6 6 6 6 1 1 1 1 1 1 1 1 1 1 1 1 1
symmnumber: 1
zpe: 540969.5 jmol-1
zpe.correction: 0.206044 hartree
zpe.thermalcorrener: 0.217740 hartree
zpe.thermalcorrenthalpy: 0.218685 hartree
zpe.thermalcorrgfe: 0.167533 hartree
zpe.sumelectzpe: -525.896507 hartree
zpe.sumelectthermal: -525.884811 hartree
zpe.sumelectthermalent: -525.883867 hartree
zpe.sumelectthermalfe: -525.935019 hartree
dipole: -0.3796 0.5117 2.1141
dipole: 2.2081
quadrupole: -63.9712 -65.0337 -78.2611
quadrupole: 0.6890 0.5177 -1.0836
quadrupole: 5.1175 4.0550 -9.1725 0.6890 0.5177 -1.0836
hfenergy: -526.1025517 hartree
pointgroup: C01 [X(C11H13F1)]
dipole: -0.1592293 0.2345752 -0.8211521 debye
dipolederiv: -0.5219337 0.0189128 -0.0853296 0.0676626 -0.2633649 0.0816121 -0.1259585 0.1051858 -0.778632 0.0651275 -0.0948336 0.0564511 -0.1349079 0.041699 0.05087 -0.1624223 0.0597282 0.0790266 0.6173701 -0.053431 0.067932 -0.1048294 0.4496625 -0.0731287 0.1680585 -0.0929119 0.7287257 -0.1031742 0.0816933 0.1067828 0.0777963 -0.2833297 -0.0402549 0.0905205 -0.0794711 -0.0736696 -0.0019207 0.0072479 -0.0797584 0.02188 0.0476127 0.0325025 0.0521245 0.056029 -0.0105786 -0.0155299 -0.0360498 -0.0569986 0.00806 0.0460667 0.0172348 -0.0882841 0.0110579 0.0066938 0.0722659 0.014866 -0.0572539 -0.0255647 -0.0504709 0.010387 0.1411889 0.0066137 -0.1196634 -0.0982979 -0.0758283 0.0052061 -0.0056205 0.0096481 0.066303 -0.0316233 0.0637599 -0.1032573 -0.1002783 0.0710459 0.0872871 0.0182301 -0.0196435 0.0575789 0.0887933 0.075161 -0.0648733 -0.0102198 0.0806326 0.0746651 0.0968929 -0.010039 0.0970827 0.0670989 0.097303 -0.0707844 -0.0442192 -0.088597 -0.0262186 -0.0784379 0.0512139 0.0927273 -0.0315698 0.0973345 -0.1034366 0.0784988 -0.0394405 0.0419076 -0.0335196 -0.0666523 0.0443991 0.0291086 0.0458822 -0.1264797 0.0100657 0.0917988 -0.0436364 0.0688073 0.0187304 0.0147153 -0.0647389 0.0450516 0.0559857 0.0601779 -0.0538709 -0.100895 -0.005833 0.0302123 -0.0534221 -0.0671025 -0.0767616 -0.0235586 0.0593913 0.0348953 0.0119665 -0.0294168 -0.1571098 -0.0787941 -0.0222798 -0.0708583 0.0782101 0.1004153 0.012563 -0.0353886 0.0470935 0.0300245 0.1041411 -0.0799258 0.0708619 -0.0371304 -0.1457811 -0.0344024 0.0932428 -0.0218883 0.0813132 -0.0217434 0.1348982 -0.0122356 -0.0076102 -0.0779191 -0.0190596 0.1580531 0.0069097 0.0716073 0.0154333 0.1387214 0.0491706 -0.0442346 -0.0569959 -0.0406973 -0.1154693 -0.0686459 0.039321 -0.0480601 -0.1249886 -0.0145633 0.0452634 0.1000822 0.0561301 0.0054535 0.0344502 -0.1485384 -0.0106614 0.0093946 -0.0693979 0.0430378 0.0736201 0.0934372 0.0265404 0.0771399 -0.0175514 -0.0751974 0.0236309 -0.077002 0.0986397 0.0348741 -0.0731546 -0.0675683 -0.069274 0.029284 -0.065098 -0.0602429 -0.0680962 0.0964385 -0.0023089 -0.0688309 -0.0619629 -0.0853233 0.0108178 -0.0956575 -0.0760021 -0.0997218 0.0881632 0.0347326 0.0736405 0.0251649 0.0940332 -0.041369 -0.0976612 0.0250328 -0.0958018 0.1047057 -0.1280429 0.0413325 -0.0301735 0.0443058 0.1008555 -0.0253084 -0.0334325 -0.0263179 0.1390184 unknown
polarizability: 145.8867893|-1.9609429|105.7530579|4.1436622|14.628793|84.3152878 unknown
InChI: InChI=1S/C11H13F/c1-10(2)8-11(10,12)9-6-4-3-5-7-9/h3-7H,8H2,1-2H3
charge 0 multiplicity 1
25 atoms
F  1.280998 -0.583157 1.775836
C  2.080393 0.240115 -0.467927
C  0.96925 -0.444228 0.351917
C  1.845218 -1.295171 -0.552077
C  3.327727 0.73062 0.26424
C  1.671438 1.091277 -1.668138
C  -0.497482 -0.207263 0.166016
C  -1.320394 -1.137564 -0.513592
C  -1.084575 0.965732 0.709246
C  -2.705363 -0.896841 -0.661248
C  -2.467915 1.20385 0.57049
C  -3.282597 0.274245 -0.119897
H  2.577848 -1.938797 -0.055204
H  1.418208 -1.709432 -1.471287
H  3.202545 1.780255 0.591033
H  3.54124 0.124058 1.159574
H  4.205355 0.68627 -0.407867
H  2.485152 1.105449 -2.417592
H  0.760313 0.705996 -2.158632
H  1.472018 2.135896 -1.362881
H  -0.877481 -2.054674 -0.918547
H  -0.453663 1.680914 1.249038
H  -3.332921 -1.623199 -1.189677
H  -2.911941 2.110582 0.996284
H  -4.356771 0.460363 -0.231007
