program: Gaussian 09
title: 000274979
version: EM64L-G09RevD.01
frameworkgroup: C1[X(C12H11NO3)]
method: RPBEPBE
basis: SDD
operation: Freq
keyword: #p
keyword: freq=noraman
keyword: PBEPBE/SDD
title: #p freq=noraman PBEPBE/SDD
converged: YES YES NO NO
title: Mulliken charges:
elementType: O O O N C C C C C C C C C C C C H H H H H H H H H H H
charge: -0.210159 -0.417599 -0.197156 0.006070 -0.258641 0.476485 0.317318 -0.308814 -0.433140 0.148750 -0.362894 -0.304308 -0.252824 -0.786347 -0.399161 0.190816 0.241961 0.233359 0.234128 0.235146 0.225800 0.258037 0.226208 0.224935 0.284337 0.243491 0.384205
chargesum: 0.00000
title: Mulliken charges with hydrogens summed into heavy atoms:
elementType: O O O N C C C C C C C C C C C C
charge: -0.210159 -0.033394 -0.197156 0.006070 -0.258641 0.476485 0.317318 -0.066853 -0.199780 0.148750 -0.128766 -0.069163 -0.027025 -0.077168 0.128667 0.190816
polarizability: 2.09588508e+02 1.75106451e+01 1.62447132e+02 -1.51246709e+01 4.31049654e+00 8.16603198e+01
1716.lowfreq: -4.1846 -0.0007 -0.0001 0.0001 3.6856 11.5345 23.6624 33.9988 57.6397
frequency: 23.5281 33.9551 57.6185 63.3184 93.6174 152.8803 168.0411 188.3432 258.2808 286.2847 303.0417 318.6413 424.7748 431.7885 440.4369 486.5825 491.0022 513.6090 520.0185 574.5545 577.5745 623.1132 630.6851 672.0170 685.5473 705.0040 755.0254 814.4156 824.8761 838.1745 845.1311 878.0323 888.6006 964.1196 974.6449 983.6258 998.3249 1010.1713 1030.6417 1045.4312 1083.3563 1097.6376 1149.3638 1184.2122 1220.0840 1237.6499 1239.4351 1253.5870 1268.0029 1296.9948 1347.3241 1355.6921 1386.8557 1403.9394 1426.0099 1441.4416 1446.6769 1467.9788 1472.1105 1502.6829 1555.1436 1601.8087 1618.2585 1693.0856 2979.5163 2992.3624 3055.7500 3080.9451 3119.5038 3124.7299 3126.8778 3146.1824 3152.3731 3165.1768 3518.2820
redmass: 8.5192 6.4376 4.7797 1.0785 4.5286 4.7406 4.4686 3.9495 6.8155 3.3368 3.6942 3.8689 4.1115 4.8142 4.4698 2.0682 4.2313 3.1284 5.4686 3.9791 5.0748 2.6830 2.0130 3.4519 6.1628 5.6596 1.3032 2.2159 4.4922 4.6766 2.1350 1.5416 4.1329 1.3236 3.6018 1.3590 1.9421 2.2541 2.8113 1.5887 2.0126 3.2350 1.2904 1.2712 1.7646 1.3943 1.8202 2.1505 2.2383 3.2783 4.7878 1.5405 1.2543 3.8984 2.4144 1.6928 1.1198 1.0471 1.7276 3.6542 6.3143 6.3652 7.0303 9.0136 1.0384 1.0642 1.0971 1.0965 1.0977 1.0879 1.0864 1.0922 1.0981 1.0975 1.0643
irintensity: 1.0235 2.2754 0.7800 0.2446 0.6063 4.7091 5.3339 0.3461 0.1859 1.4722 0.6294 0.5723 2.0831 7.7901 20.3468 26.6724 15.9665 2.1910 11.7693 1.7872 9.0330 41.9502 102.8765 1.0048 10.1248 6.9476 51.2375 11.5642 7.3250 5.2154 36.4471 15.0034 0.3392 0.8840 61.5740 1.6153 99.2067 26.8380 319.6672 7.7284 7.7965 51.8072 3.8622 8.2968 28.2741 59.4592 39.6477 12.0534 24.5134 7.0793 15.7631 24.9861 20.6656 27.6247 62.2949 51.9390 32.2471 15.7439 11.7486 27.4663 79.2245 37.5724 4.6829 194.3624 26.3221 33.4128 20.8628 6.3978 8.6181 4.2900 1.1819 27.5666 29.2691 22.6422 30.0392
temp: 298.150 k
press: 1.00000 atm
elementType: 8 8 8 7 6 6 6 6 6 6 6 6 6 6 6 6 1 1 1 1 1 1 1 1 1 1 1
symmnumber: 1
zpe: 537042.6 jmol-1
zpe.correction: 0.204549 hartree
zpe.thermalcorrener: 0.218789 hartree
zpe.thermalcorrenthalpy: 0.219733 hartree
zpe.thermalcorrgfe: 0.161386 hartree
zpe.sumelectzpe: -743.152640 hartree
zpe.sumelectthermal: -743.138400 hartree
zpe.sumelectthermalent: -743.137455 hartree
zpe.sumelectthermalfe: -743.195802 hartree
dipole: 0.5609 1.7645 -1.0251
dipole: 2.1163
quadrupole: -64.1415 -85.7490 -98.3250
quadrupole: -0.1530 -3.0535 0.9324
quadrupole: 18.5970 -3.0105 -15.5865 -0.1530 -3.0535 0.9324
hfenergy: -743.3571888 hartree
pointgroup: C01 [X(C12H11N1O3)]
dipole: 0.0240066 -0.8031121 -0.2184084 debye
polarizability: 193.2937563|31.3255607|173.7386997|8.219564|-21.6432429|86.6635041 unknown
InChI: InChI=1S/C12H11NO3/c1-8-5-6-9-3-2-4-10(12(9)13-8)16-7-11(14)15/h2-6,14H,7H2,1H3
charge 0 multiplicity 1
27 atoms
O  -1.517833 0.331544 -0.471845
O  -4.826241 -1.04317 0.394039
O  -3.199612 -0.187305 1.829372
N  0.93169 1.492781 -0.33819
C  0.833173 0.152711 -0.003223
C  1.973698 -0.641036 0.402849
C  -0.460866 -0.491987 -0.058628
C  3.241531 0.02749 0.452922
C  1.814724 -2.024495 0.732495
C  2.142099 2.088782 -0.278884
C  -0.591062 -1.848662 0.270862
C  3.329033 1.376403 0.118298
C  0.551041 -2.609309 0.664896
C  2.216042 3.555654 -0.6489
C  -2.827987 -0.260837 -0.64084
C  -3.574259 -0.471953 0.679567
H  4.131005 -0.536676 0.757256
H  2.689103 -2.609838 1.039108
H  -1.566009 -2.344821 0.253074
H  4.287067 1.90611 0.151511
H  0.417056 -3.665719 0.921436
H  1.210831 3.920116 -0.9092
H  2.609152 4.160003 0.190485
H  2.889963 3.717699 -1.511587
H  -3.399987 0.466026 -1.241991
H  -2.797094 -1.216167 -1.201203
H  -5.344657 -1.151642 1.236823
