program: Gaussian 09
title: 000274960
version: EM64L-G09RevD.01
frameworkgroup: C1[X(C13H8BrFN2O)]
method: RPBEPBE
basis: SDD
operation: Freq
keyword: #p
keyword: freq=noraman
keyword: PBEPBE/SDD
title: #p freq=noraman PBEPBE/SDD
converged: NO YES NO YES
title: Mulliken charges:
elementType: Br F O N N C C C C C C C C C C C C C H H H H H H H H
charge: 0.004819 -0.199835 -0.257723 -0.448551 -0.697247 0.274587 0.331680 0.352270 0.132827 -0.019500 -0.331245 -0.620819 -0.340762 -0.518138 0.755812 -0.599269 -0.390185 0.346819 0.331773 0.235579 0.228331 0.228062 0.301468 0.257702 0.313796 0.327748
chargesum: 0.00000
title: Mulliken charges with hydrogens summed into heavy atoms:
elementType: Br F O N N C C C C C C C C C C C C C
charge: 0.004819 -0.199835 -0.257723 -0.116778 -0.055704 0.274587 0.331680 0.352270 0.132827 -0.019500 -0.095666 -0.392488 -0.112700 -0.216670 0.755812 -0.599269 -0.132482 0.346819
polarizability: 3.20498418e+02 -9.10863188e+00 1.99583210e+02 2.52833800e-03 2.33008347e-03 6.42629003e+01
1716.lowfreq: -5.0124 -0.9387 -0.0001 0.0002 0.0005 5.7580 49.3809 60.0878 107.4917
frequency: 49.3674 60.0779 107.4900 124.5934 147.9379 175.7686 216.5419 231.6675 254.8402 276.7828 307.5071 312.8875 383.0061 385.6884 417.9300 434.8382 453.5416 460.5964 473.2048 474.2805 503.0891 536.8261 540.0089 610.7505 657.5125 669.7628 683.1170 704.5424 715.5107 716.0271 743.7053 784.2829 805.4887 826.3766 860.2799 885.3186 904.5748 923.7240 952.8940 982.4832 997.8196 1052.6757 1071.1522 1142.4463 1174.0014 1215.1208 1244.2722 1260.4199 1287.3027 1293.6927 1341.1742 1369.0380 1390.4374 1403.8904 1425.8314 1471.2198 1480.3201 1529.5797 1555.2467 1583.5263 1617.3996 1626.9590 1631.7448 1645.2977 3121.3814 3151.3957 3168.7011 3171.4832 3176.5825 3515.3327 3546.0518 3692.0318
redmass: 8.0858 6.9681 13.5398 6.4190 4.7952 7.8367 9.2680 12.3320 5.1708 7.0931 7.0903 5.7866 7.2224 2.8911 1.2652 2.9392 2.2896 7.7076 4.1517 1.5529 7.1713 3.1021 8.3889 5.3858 2.6274 6.5236 6.4182 7.7521 6.0271 2.0293 1.8606 3.2533 6.2321 1.6299 2.1206 1.6006 5.5915 1.4761 1.3537 2.7110 7.3932 1.5385 2.1476 1.4594 2.8873 1.5618 2.3848 1.6851 3.3869 1.7221 5.6384 2.2797 7.5764 4.4775 5.5263 3.7660 3.8722 4.4198 7.2813 7.0613 4.6271 2.3500 3.5918 2.5445 1.0914 1.0883 1.0911 1.0929 1.0963 1.0764 1.0459 1.1033
irintensity: 3.6214 0.1473 0.3147 0.1606 2.2067 3.5811 0.8986 3.2872 1.5385 1.7260 0.1093 0.0105 6.7858 22.9774 36.3787 41.6947 124.1112 7.9529 5.4753 78.3528 1.4486 1.1132 44.3802 6.8426 30.6722 3.6990 0.0005 9.4233 7.4967 11.7708 44.6986 6.8011 12.0812 29.5030 104.3703 6.8927 66.7224 23.0272 0.2356 13.8720 29.4645 13.2078 2.2573 12.3255 32.3226 13.2737 9.3932 12.1220 16.3017 122.0544 110.2079 10.0096 41.0386 16.7975 5.4733 240.4386 121.4824 27.9917 25.0437 23.9869 184.4984 4.8854 308.4861 528.5643 14.1534 6.5395 0.8285 4.1204 8.8566 31.9039 138.4831 38.6049
temp: 298.150 k
press: 1.00000 atm
elementType: 35 9 8 7 7 6 6 6 6 6 6 6 6 6 6 6 6 6 1 1 1 1 1 1 1 1
symmnumber: 1
zpe: 479154.3 jmol-1
zpe.correction: 0.182500 hartree
zpe.thermalcorrener: 0.197033 hartree
zpe.thermalcorrenthalpy: 0.197977 hartree
zpe.thermalcorrgfe: 0.140351 hartree
zpe.sumelectzpe: -797.035280 hartree
zpe.sumelectthermal: -797.020747 hartree
zpe.sumelectthermalent: -797.019803 hartree
zpe.sumelectthermalfe: -797.077429 hartree
dipole: -6.3339 0.8387 -0.0014
dipole: 6.3892
quadrupole: -124.9583 -99.8435 -117.2044
quadrupole: -18.3894 0.0011 -0.0028
quadrupole: -10.9562 14.1585 -3.2023 -18.3894 0.0011 -0.0028
hfenergy: -797.21778 hartree
pointgroup: C01 [X(C13H8Br1F1N2O1)]
dipole: -2.5045217 -0.2145895 -0.0005647 debye
dipolederiv: -0.4102803 -0.2589412 -0.0000253 -0.3919865 -0.4096063 -0.0000165 -0.0001963 -0.0001477 -0.0260722 -1.416443 0.2307664 -0.0000653 0.2047261 -0.2225825 0.0000051 0.0002348 0.000258 -0.1483494 -0.8873522 -0.3920433 0.0000318 -0.6078904 -1.1860941 0.0000234 -0.0000853 -0.0001283 -0.3679983 -1.1709399 -0.5317021 -0.0001125 -0.1180305 -0.4199876 -0.0000164 -0.0000592 -0.0000314 -0.2981876 -1.8466439 0.2657866 0.0001872 0.4102364 -0.21144 -0.0000312 0.00066 -0.000153 -0.6919857 -0.6113127 -0.0724413 0.0000321 -0.0991176 -0.2955755 0.0000073 0.0000804 0.0000095 -0.0489575 0.8358974 0.0084918 -0.0000162 -0.292069 -0.0502052 -0.0000008 -0.000307 -0.0001554 0.024034 0.7398077 0.2047829 -0.0000009 0.2856942 0.6233088 0.0000193 0.0003932 0.0002989 0.130363 -0.032666 0.21542 0.0000261 -0.2261578 -0.4596176 -0.0000256 0.0005158 0.0004296 -0.0042805 1.4743345 0.4566046 0.0000476 0.4016071 1.3886205 0.0000271 -0.0000036 -0.0000095 0.187422 0.4259239 0.0893435 -0.0000256 -0.0325268 -0.0421755 -0.0000068 -0.0006447 -0.0004732 -0.029098 -0.6044695 0.0826519 0.0000149 -0.3764649 0.0009079 0.0000246 -0.0001787 -0.0000661 -0.2768725 -0.2401457 0.0076531 -0.0000029 0.3262122 0.0891163 0.0000044 0.0002056 0.000147 -0.1410717 -0.2484266 -0.1373076 -0.0000196 0.3768195 -0.0232154 -0.0000028 -0.0001851 -0.0001264 -0.1103767 1.6668063 -0.4878125 -0.0001803 -0.6794787 0.0201852 0.0000011 -0.0003629 -0.0000467 0.2012588 -0.0556916 0.4843717 0.0000682 1.3526294 0.5578246 0.0000742 0.0005452 0.000401 -0.2258009 -0.0470791 0.1052367 0.0000134 -0.1067733 0.0891739 -0.0000033 -0.0000627 -0.0000431 -0.1358636 1.44459 -0.230373 0.0000891 -0.3705235 0.0983398 0.0000108 -0.0002505 -0.0002796 0.0721552 0.1130908 0.0121899 0.0000137 0.0015406 0.1811783 -0.0000105 0.0000624 0.0000193 0.3139032 0.1255707 0.0675904 0.0000153 0.0363158 -0.0256054 -0.0000361 0.0002146 0.0001483 0.1397595 0.0120325 0.0170172 0.0000038 0.0522796 -0.1080278 -0.0000198 -0.0000344 -0.0000641 0.1846215 0.0316918 -0.1107544 -0.0000119 -0.0746769 -0.0137849 -0.0000143 -0.0001282 -0.0001141 0.1441629 0.1044011 -0.0065072 -0.0000077 -0.080887 0.0919244 -0.0000083 -0.000042 -0.0000214 0.177977 0.0660974 0.05206 -0.0000027 0.074913 -0.0157343 -0.0000067 -0.000027 -0.0000081 0.1747462 0.2444594 -0.0446555 -0.0000267 -0.1069558 0.1321231 0.0000536 -0.0002189 0.0001186 0.3803902 0.2867471 -0.0274285 -0.0000459 0.0405647 0.2109495 -0.0000516 -0.0001253 0.0000378 0.3741211 unknown
polarizability: 318.7193391|17.1732276|201.3622893|0.001967|0.00282|64.2629003 unknown
InChI: InChI=1S/C13H8BrFN2O/c14-10-4-8-7-2-1-6(15)3-9(7)13(18)17-12(8)5-11(10)16/h1-5,17H,16H2
charge 0 multiplicity 1
26 atoms
Br -4.262464 -2.509473 -0.00037
F  5.010116 -1.096875 0.000181
O  1.95142 3.027702 0.000283
N  -0.185078 2.122187 -0.000041
N  -4.820274 0.60708 0.000034
C  -0.632109 -0.278379 -0.000181
C  0.814804 -0.521435 -0.000134
C  -1.112758 1.070678 -0.000088
C  1.713658 0.596179 -0.00006
C  1.213139 1.994628 -0.000154
C  -1.608264 -1.311194 -0.000248
C  -2.494566 1.360629 -0.000056
C  1.384332 -1.830278 -0.000115
C  3.118923 0.410717 0.00006
C  -3.464808 0.325283 -0.000112
C  -2.973974 -1.021334 -0.000229
C  2.774069 -2.023278 -0.000011
C  3.61832 -0.890871 0.000079
H  -0.524488 3.08901 0.000078
H  -1.29735 -2.358985 -0.000316
H  -2.832098 2.404575 0.000032
H  0.738545 -2.713057 -0.000167
H  3.773571 1.28742 0.000109
H  3.211355 -3.026242 0.00001
H  -5.153836 1.566498 -0.00019
H  -5.499682 -0.150687 -0.000298
