program: Gaussian 09
title: 000274967
version: EM64L-G09RevD.01
frameworkgroup: C1[X(C15H12N2O2)]
method: RPBEPBE
basis: SDD
operation: Freq
keyword: #p
keyword: freq=noraman
keyword: PBEPBE/SDD
title: #p freq=noraman PBEPBE/SDD
converged: YES YES NO NO
title: Mulliken charges:
elementType: O O N N C C C C C C C C C C C C C C C H H H H H H H H H H H H
charge: -0.258385 -0.246851 -0.441324 -0.479234 0.064355 0.301917 0.331241 0.094543 0.334721 -0.028637 -0.439335 -0.415705 -0.399444 -0.352989 -0.218343 -0.235331 -0.245486 0.215229 -0.784482 0.334267 0.234690 0.269724 0.309082 0.281421 0.233638 0.330478 0.233569 0.239559 0.216322 0.261250 0.259541
chargesum: 0.00000
title: Mulliken charges with hydrogens summed into heavy atoms:
elementType: O O N N C C C C C C C C C C C C C C C
charge: -0.258385 -0.246851 -0.107057 -0.148756 0.064355 0.301917 0.331241 0.094543 0.334721 -0.028637 -0.204645 -0.145981 -0.090362 -0.071569 0.015295 -0.001762 -0.005927 0.215229 -0.047369
polarizability: 2.65435251e+02 -1.38077345e+01 2.38788083e+02 1.08493265e+01 1.67235026e-01 8.22715223e+01
1716.lowfreq: -5.5190 -0.0007 -0.0001 0.0003 1.5092 5.5886 40.1900 57.9580 72.3700
frequency: 40.1854 57.9386 72.3584 86.5067 105.7091 122.9436 154.2047 209.3918 244.2384 252.2566 266.8537 314.5036 340.7279 364.8768 405.8878 425.2235 453.6740 476.3418 491.2203 526.4648 557.6871 578.4155 599.2684 618.8852 630.8223 641.9728 662.4214 677.7662 715.7867 720.9584 747.1973 776.3664 780.6979 803.7636 809.0083 823.0215 897.5913 906.8204 914.6412 983.2672 986.1173 987.7853 988.2831 1007.0779 1036.4772 1041.4069 1061.5944 1093.1669 1101.5912 1143.5951 1179.1858 1189.9654 1220.0109 1235.3220 1265.3592 1283.7868 1303.3184 1317.0212 1374.5351 1380.8794 1389.2336 1392.0332 1431.9231 1447.5179 1451.3387 1464.0364 1469.5115 1491.4710 1515.0207 1558.8697 1594.6861 1606.0005 1615.5687 1630.6861 1632.2024 2993.7164 3089.8580 3104.7939 3132.0754 3132.6324 3149.1396 3158.6825 3160.3585 3171.8903 3199.9587 3517.3286 3518.3614
redmass: 6.6005 3.4130 1.2957 4.6807 2.8804 5.8203 4.7090 5.0922 4.5541 6.9322 5.3192 7.3087 4.6920 4.9560 5.6205 3.7318 5.6136 4.7947 5.8369 4.4546 3.2774 3.5659 5.5183 3.2178 3.9670 2.8907 4.2587 1.4331 2.2806 4.2647 2.0867 3.5990 2.2219 1.8947 2.6984 4.1871 1.5592 1.9660 2.0782 1.3460 1.5996 6.5400 1.5364 1.3474 2.0199 2.1189 2.3185 2.3216 2.2920 1.9125 1.1127 1.2831 1.9686 1.7667 1.9163 3.1391 2.7538 2.4728 4.5918 6.2291 1.6287 2.0443 2.2492 1.6301 1.2952 2.7364 1.1224 3.0022 2.2536 6.1033 6.7802 7.0673 6.3163 5.1767 4.5900 1.0366 1.0993 1.0990 1.0883 1.0862 1.0893 1.0957 1.0939 1.1004 1.0949 1.0764 1.0767
irintensity: 5.7220 6.7087 0.5605 2.2926 3.2663 0.5310 1.6746 6.5098 3.5126 0.8664 0.7832 8.5447 4.5563 2.0797 1.3234 2.7616 9.2622 1.8621 5.6158 9.5285 2.9584 2.5517 3.4385 1.4327 5.9876 6.3066 13.8188 119.0671 4.8258 5.1784 75.3732 2.7461 1.4566 50.2047 68.4009 24.1888 3.5269 2.1188 2.5135 4.9134 4.5426 1.6040 15.6996 1.3177 12.0069 5.9149 9.0775 3.1975 4.6774 23.9088 1.3881 20.6424 16.6699 53.0375 58.2897 19.4764 105.9828 61.8896 45.8507 109.6085 18.6310 24.2791 66.0995 67.5897 25.6874 98.4203 24.0184 10.9576 271.5340 50.7456 73.0409 102.2448 111.4071 504.9835 18.8160 8.7117 14.2169 10.7168 6.9017 3.1404 4.7451 19.2336 7.2583 22.7537 8.3005 38.0730 34.4503
temp: 298.150 k
press: 1.00000 atm
elementType: 8 8 7 7 6 6 6 6 6 6 6 6 6 6 6 6 6 6 6 1 1 1 1 1 1 1 1 1 1 1 1
symmnumber: 1
zpe: 624888.8 jmol-1
zpe.correction: 0.238008 hartree
zpe.thermalcorrener: 0.253366 hartree
zpe.thermalcorrenthalpy: 0.254310 hartree
zpe.thermalcorrgfe: 0.194913 hartree
zpe.sumelectzpe: -837.495136 hartree
zpe.sumelectthermal: -837.479777 hartree
zpe.sumelectthermalent: -837.478833 hartree
zpe.sumelectthermalfe: -837.538230 hartree
dipole: -1.0539 -2.2382 0.4652
dipole: 2.5173
quadrupole: -136.9517 -84.6046 -113.7777
quadrupole: 2.7427 -7.8216 -1.0454
quadrupole: -25.1737 27.1734 -1.9997 2.7427 -7.8216 -1.0454
hfenergy: -837.7331434 hartree
pointgroup: C01 [X(C15H12N2O2)]
dipole: -0.4263651 -0.8916369 0.0635953 debye
polarizability: 264.7611934|-15.7056|236.5927139|11.8645443|19.5263117|85.1409492 unknown
InChI: InChI=1S/C15H12N2O2/c1-9(18)16-12-7-4-8-13-14(12)10-5-2-3-6-11(10)15(19)17-13/h2-8,16-17H,1H3
charge 0 multiplicity 1
31 atoms
O  4.020346 0.863615 0.618935
O  -4.490474 0.086557 -0.430223
N  1.961963 1.871948 0.248343
N  -2.274841 -0.559915 0.048498
C  -0.113824 0.621486 -0.123444
C  0.715784 -0.58629 -0.329992
C  0.569127 1.867323 0.068994
C  2.120883 -0.53031 -0.033306
C  -1.555987 0.663834 -0.080522
C  2.790104 0.746218 0.325453
C  -0.12277 3.103787 0.097623
C  0.230869 -1.811218 -0.893212
C  -2.245986 1.900006 -0.074364
C  2.948101 -1.673683 -0.165248
C  -1.5215 3.110137 -0.016617
C  1.064871 -2.935045 -1.039304
C  2.423988 -2.886978 -0.639586
C  -3.650137 -0.793524 -0.085107
C  -4.072793 -2.22723 0.23224
H  2.430467 2.768071 0.413061
H  0.43682 4.038716 0.214858
H  -0.781852 -1.863957 -1.302264
H  -3.336075 1.895397 -0.0973
H  4.007055 -1.560272 0.089429
H  -2.065176 4.060483 -0.017218
H  -1.719777 -1.3626 0.352752
H  0.658357 -3.849045 -1.486685
H  3.063949 -3.769376 -0.739872
H  -3.228571 -2.922918 0.38279
H  -4.704767 -2.601346 -0.59041
H  -4.693657 -2.226171 1.145696
