program: Gaussian 09
title: 000274959
version: EM64L-G09RevD.01
frameworkgroup: C1[X(C13H6Cl4N2O)]
method: RPBEPBE
basis: SDD
operation: Freq
keyword: #p
keyword: freq=noraman
keyword: PBEPBE/SDD
title: #p freq=noraman PBEPBE/SDD
converged: YES YES YES YES
title: Mulliken charges:
elementType: Cl Cl Cl Cl O N N C C C C C C C C C C C C C H H H H H H
charge: 0.004172 -0.035802 0.004906 -0.039569 -0.246621 -0.458527 -0.682669 0.530793 0.323333 0.473244 0.098006 -0.477202 -0.011298 -0.730768 -0.336990 0.889119 -0.456604 -0.304781 -0.230486 -0.133154 0.346611 0.251138 0.301608 0.257647 0.331680 0.332214
chargesum: 0.00000
title: Mulliken charges with hydrogens summed into heavy atoms:
elementType: Cl Cl Cl Cl O N N C C C C C C C C C C C C C
charge: 0.004172 -0.035802 0.004906 -0.039569 -0.246621 -0.111916 -0.018775 0.530793 0.323333 0.473244 0.098006 -0.477202 -0.011298 -0.730768 -0.085852 0.889119 -0.456604 -0.003173 0.027161 -0.133154
polarizability: 3.62024159e+02 -5.56465587e-01 2.32718599e+02 -2.87240774e+00 3.75899319e+00 7.21419607e+01
1716.lowfreq: -0.0023 -0.0016 -0.0014 0.8531 3.9946 4.5112 28.2414 46.3363 59.8222
frequency: 28.2277 46.3359 59.8221 101.8359 120.8914 132.4278 151.5422 196.7263 204.6453 214.4494 236.8605 251.3999 275.4758 300.9442 313.8839 327.7621 335.2385 345.6544 388.5427 411.8713 432.8210 451.0296 477.9875 498.3773 503.7583 523.1390 549.3891 587.2479 592.8505 649.9713 653.4800 664.7251 680.1142 730.5786 750.0992 775.1377 782.8692 809.6988 827.6296 832.2264 887.5896 935.5736 966.1518 1016.7887 1060.5620 1085.3508 1086.9061 1114.8515 1171.4860 1219.6377 1281.6283 1284.6883 1327.0869 1358.1170 1375.6553 1386.6441 1404.9238 1444.7212 1462.6181 1509.5819 1527.3393 1558.3557 1597.3839 1607.9365 1631.8004 1638.4026 3166.3288 3170.1043 3234.2963 3487.5185 3541.4365 3685.5507
redmass: 11.3656 9.0036 18.2735 8.5419 12.7730 10.5921 6.2369 23.6422 12.4440 7.7750 20.7500 15.2411 7.7370 14.3479 14.2732 4.9270 7.3180 7.1691 5.8054 9.7097 4.3144 8.7172 1.0848 5.7936 1.3038 3.6018 8.3111 6.8522 9.0243 7.4300 4.0055 5.6386 6.2793 6.7337 1.7892 10.1982 3.6501 3.1103 6.5336 2.0944 8.1281 1.4168 1.3575 7.4610 3.8194 1.8422 2.3770 4.1040 1.6424 2.5999 1.6456 4.0723 5.9343 3.1818 4.3210 6.7086 4.5093 6.1873 2.6115 4.9781 6.8430 8.1553 3.3050 2.7283 5.0212 2.4430 1.0921 1.0928 1.0914 1.0760 1.0450 1.1044
irintensity: 2.1902 0.4800 0.0529 0.6823 0.0790 0.0288 0.0024 0.9455 1.6457 8.6840 0.6572 0.1153 1.0890 1.8574 0.7009 3.6329 0.4418 2.9637 5.6492 18.0412 6.8243 15.5601 8.0628 14.5737 255.3592 2.5088 24.2602 19.9632 7.2541 1.6642 22.5961 13.6189 1.4084 17.1677 56.4072 20.9326 26.1070 7.5578 74.6228 61.3594 16.8059 13.2521 1.0610 17.2909 18.4056 17.4880 20.0286 63.4609 9.2120 11.2189 49.3213 26.3742 112.9732 28.3699 119.4784 13.9932 15.7299 5.5096 241.3901 5.0328 6.7311 23.0090 21.4305 4.4142 543.4313 530.4734 1.5212 5.3786 4.7847 61.9241 178.3803 51.0685
temp: 298.150 k
press: 1.00000 atm
elementType: 17 17 17 17 8 7 7 6 6 6 6 6 6 6 6 6 6 6 6 6 1 1 1 1 1 1
symmnumber: 1
zpe: 427334.1 jmol-1
zpe.correction: 0.162763 hartree
zpe.thermalcorrener: 0.180023 hartree
zpe.thermalcorrenthalpy: 0.180967 hartree
zpe.thermalcorrgfe: 0.116536 hartree
zpe.sumelectzpe: -2522.616199 hartree
zpe.sumelectthermal: -2522.598939 hartree
zpe.sumelectthermalent: -2522.597995 hartree
zpe.sumelectthermalfe: -2522.662426 hartree
dipole: 5.7503 -1.3528 -0.7255
dipole: 5.9517
quadrupole: -132.3164 -147.4923 -145.2977
quadrupole: 15.1235 0.3662 -0.1050
quadrupole: 9.3857 -5.7901 -3.5956 15.1235 0.3662 -0.1050
hfenergy: -2522.7789622 hartree
pointgroup: C01 [X(C13H6Cl4N2O1)]
dipole: -2.2631904 -0.5508218 0.2398177 debye
dipolederiv: -0.1091509 0.139124 0.0264797 0.0619811 -0.570499 -0.0944654 -0.002395 -0.0990309 -0.0343851 -0.2475778 0.180501 0.017251 0.2696788 -0.6102292 -0.0440221 0.0315867 -0.0303208 -0.0269028 -0.4702602 -0.3163204 -0.0197924 -0.3794432 -0.385244 -0.025806 -0.0187215 -0.0407073 -0.0139801 -1.0913555 0.0893341 -0.0072957 0.0593253 -0.1083963 0.0052573 -0.0088052 0.0047429 -0.0593424 -0.7935273 -0.3317062 0.0222667 -0.4967951 -1.1852841 0.0542675 0.0378265 0.0357696 -0.3615811 -1.2043872 -0.5507825 0.025376 -0.1209697 -0.5429766 0.0018558 0.0542813 0.0236008 -0.2846296 -1.8925716 0.1695249 0.0478517 0.3219266 -0.2202048 0.0232167 0.0924224 0.0274479 -0.6525587 -0.5313533 0.0252734 0.0305012 -0.1869865 -0.4631404 -0.0376665 0.046431 -0.0496323 -0.0255698 0.7097768 0.0902732 0.0233099 -0.2015843 0.010347 -0.0180933 0.055416 -0.0144362 0.0251438 0.6244441 0.1702852 -0.0222686 0.4502942 0.4619028 -0.011753 -0.0003852 -0.0189234 0.1779027 0.0060259 0.1759087 -0.0131136 0.0242069 -0.4695229 0.0282254 -0.0457969 0.0245423 -0.0050509 0.6624743 -0.0319066 -0.0440292 -0.0046928 0.865144 0.1732462 -0.0773613 0.1565596 0.0108519 1.4742178 0.4437571 -0.0639156 0.2532454 1.4166465 -0.0772196 -0.0982732 -0.0840789 0.2050843 -0.3837002 -0.2603292 -0.000383 -0.7687054 0.8241613 0.0801855 -0.038734 0.0590831 -0.2054634 -0.3190108 0.0386958 -0.0257691 0.1149811 0.0264446 -0.0312102 -0.0261752 -0.0098725 -0.131203 1.6826627 -0.1466891 -0.0725641 -0.5310474 -0.1274088 -0.0130878 -0.1523235 -0.0169225 0.2273234 -0.1514786 0.3276594 0.039999 1.2157399 0.3010536 0.0035784 0.1387489 0.0334858 -0.1401111 -0.4646564 -0.0694662 0.0050295 0.28352 0.0024131 -0.0012901 -0.0266923 0.0045692 -0.0593185 -0.1826778 -0.0011069 0.0104065 -0.0046043 0.100129 -0.0250671 0.0230953 -0.0212746 -0.0803025 1.5241654 -0.1049845 0.0015394 -0.2612657 -0.0219489 -0.011252 0.0179087 -0.0020211 -0.0808553 0.2013247 -0.0134493 0.0052061 -0.0360788 0.218605 0.0004294 0.0053204 0.0135393 0.3048893 0.1301848 -0.0404756 0.0215815 -0.0007356 0.0231745 0.0223819 0.0077796 0.0121456 0.1502872 0.1199861 -0.0071988 0.0005476 -0.0766636 0.0861598 0.0056054 0.0103461 0.0005022 0.1611215 0.0534838 0.0571558 -0.0094362 0.0708436 -0.0021299 0.020084 -0.0088347 0.0171783 0.1557631 0.3064524 -0.0245846 0.0008097 -0.1065978 0.1797782 -0.0138759 -0.0124207 -0.0113157 0.3735863 0.3465088 -0.0084928 0.0004119 0.0504275 0.1910253 -0.0135245 -0.0042441 -0.0146303 0.3693006 unknown
polarizability: 362.0475963|0.9228159|232.6757581|-0.6143602|4.6416775|72.1613643 unknown
InChI: InChI=1S/C13H6Cl4N2O/c14-4-1-2-5-6(3-4)13(20)19-12-7(5)8(15)9(16)11(18)10(12)17/h1-3,19H,18H2
charge 0 multiplicity 1
26 atoms
Cl -0.926317 -3.172719 -0.479887
Cl -3.007748 2.870982 0.175693
Cl -3.98423 -2.558731 -0.225201
Cl 5.739148 -0.677213 0.034427
O  1.916069 3.12016 -0.169693
N  -0.131032 2.053715 0.004741
N  -4.673529 0.33686 0.106733
C  -0.420077 -0.391517 -0.058553
C  1.057643 -0.511769 -0.011715
C  -0.974147 0.942068 0.009173
C  1.861407 0.679803 -0.078498
C  -1.391902 -1.441333 -0.1646
C  1.264873 2.034944 -0.101213
C  -2.368981 1.157031 0.065408
C  1.773681 -1.74064 0.139627
C  -3.317245 0.111086 0.033698
C  -2.776441 -1.204791 -0.1056
C  3.277921 0.63476 -0.071471
C  3.177855 -1.790766 0.15924
C  3.922531 -0.598725 0.03141
H  -0.558218 2.986148 0.040623
H  1.24018 -2.679858 0.261328
H  3.821575 1.582024 -0.132768
H  3.688392 -2.750889 0.278611
H  -5.029114 1.286112 0.190246
H  -5.321093 -0.446339 0.05954
